BDBM50442167 CHEMBL2441339
SMILES: Cc1cccc(CC(=O)N2CCc3cc(ccc23)-c2cn(C)c3ncnc(N)c23)n1
InChI Key: InChIKey=VYZYOJULVVGQRS-UHFFFAOYSA-N
Data: 2 IC50
Activity Spreadsheet -- Enzyme Inhibition Constant Data from BindingDB
Found 2 hits for monomerid = 50442167
Trg + Lig
Ki
nM
ΔG°
kcal/mole
IC50
nM
Kd
nM
EC50/IC50
nM
koff
s-1
kon
M-1s-1
pHTemp
°C
Eukaryotic translation initiation factor 2-alpha kinase 3
(Homo sapiens (Human))
BDBM50442167
(CHEMBL2441339)
Show SMILES Cc1cccc(CC(=O)N2CCc3cc(ccc23)-c2cn(C)c3ncnc(N)c23)n1
Show InChI InChI=1S/C23H22N6O/c1-14-4-3-5-17(27-14)11-20(30)29-9-8-16-10-15(6-7-19(16)29)18-12-28(2)23-21(18)22(24)25-13-26-23/h3-7,10,12-13H,8-9,11H2,1-2H3,(H2,24,25,26)
n/an/a 2.5n/an/an/an/an/an/a
GlaxoSmithKline Research and Development
Curated by ChEMBL
Assay Description
Inhibition of GST-tagged PERK cytoplasmic domain (536 to 1116) (unknown origin) assessed as biotinylated His6-tagged EIF2alpha phosphorylation preinc...
ACS Med Chem Lett 4: 964-8 (2013)
Article DOI: 10.1021/ml400228e
BindingDB Entry DOI: 10.7270/Q24X597X
Eukaryotic translation initiation factor 2-alpha kinase 3
(Homo sapiens (Human))
BDBM50442167
(CHEMBL2441339)
Show SMILES Cc1cccc(CC(=O)N2CCc3cc(ccc23)-c2cn(C)c3ncnc(N)c23)n1
Show InChI InChI=1S/C23H22N6O/c1-14-4-3-5-17(27-14)11-20(30)29-9-8-16-10-15(6-7-19(16)29)18-12-28(2)23-21(18)22(24)25-13-26-23/h3-7,10,12-13H,8-9,11H2,1-2H3,(H2,24,25,26)
n/an/a 100n/an/an/an/an/an/a
GlaxoSmithKline Research and Development
Curated by ChEMBL
Assay Description
Inhibition of thapsigargin-induced autophosphorylation of PERK in human A549 cells preincubated for 1 hr followed by thapsigargin-induction measured ...
ACS Med Chem Lett 4: 964-8 (2013)
Article DOI: 10.1021/ml400228e
BindingDB Entry DOI: 10.7270/Q24X597X