BDBM50442264 CHEMBL2442120
SMILES: CC(Sc1cc(cnc1N)-c1ccc(C(=O)N2CCN(C)CC2)c(F)c1)c1c(Cl)ccc(F)c1Cl
InChI Key: InChIKey=FGURHPQRVNDCDB-UHFFFAOYSA-N
Data: 1 IC50
Activity Spreadsheet -- Enzyme Inhibition Constant Data from BindingDB
Found 1 hit for monomerid = 50442264
Trg + Lig
Ki
nM
ΔG°
kcal/mole
IC50
nM
Kd
nM
EC50/IC50
nM
koff
s-1
kon
M-1s-1
pHTemp
°C
Hepatocyte growth factor receptor
(Homo sapiens (Human))
BDBM50442264
(CHEMBL2442120)
Show SMILES CC(Sc1cc(cnc1N)-c1ccc(C(=O)N2CCN(C)CC2)c(F)c1)c1c(Cl)ccc(F)c1Cl
Show InChI InChI=1S/C25H24Cl2F2N4OS/c1-14(22-18(26)5-6-19(28)23(22)27)35-21-12-16(13-31-24(21)30)15-3-4-17(20(29)11-15)25(34)33-9-7-32(2)8-10-33/h3-6,11-14H,7-10H2,1-2H3,(H2,30,31)
n/an/a 65n/an/an/an/an/an/a
Chinese Academy of Sciences
Curated by ChEMBL
Assay Description
Inhibition of c-Met (unknown origin) using poly (Glu, Tyr) 4:1 as substrate after 60 mins by ELISA
Bioorg Med Chem 21: 6804-20 (2013)
Article DOI: 10.1016/j.bmc.2013.07.032
BindingDB Entry DOI: 10.7270/Q27P90TV