BDBM50442271 CHEMBL2442113
SMILES: CC(Sc1cc(cnc1N)-c1ccc(cc1)C(=O)N1CCOCC1)c1c(Cl)ccc(F)c1Cl
InChI Key: InChIKey=JPRNFUCKTHTFOS-UHFFFAOYSA-N
Data: 1 IC50
Activity Spreadsheet -- Enzyme Inhibition Constant Data from BindingDB
Found 1 hit for monomerid = 50442271
Trg + Lig
Ki
nM
ΔG°
kcal/mole
IC50
nM
Kd
nM
EC50/IC50
nM
koff
s-1
kon
M-1s-1
pHTemp
°C
Hepatocyte growth factor receptor
(Homo sapiens (Human))
BDBM50442271
(CHEMBL2442113)
Show SMILES CC(Sc1cc(cnc1N)-c1ccc(cc1)C(=O)N1CCOCC1)c1c(Cl)ccc(F)c1Cl
Show InChI InChI=1S/C24H22Cl2FN3O2S/c1-14(21-18(25)6-7-19(27)22(21)26)33-20-12-17(13-29-23(20)28)15-2-4-16(5-3-15)24(31)30-8-10-32-11-9-30/h2-7,12-14H,8-11H2,1H3,(H2,28,29)
n/an/a 45n/an/an/an/an/an/a
Chinese Academy of Sciences
Curated by ChEMBL
Assay Description
Inhibition of c-Met (unknown origin) using poly (Glu, Tyr) 4:1 as substrate after 60 mins by ELISA
Bioorg Med Chem 21: 6804-20 (2013)
Article DOI: 10.1016/j.bmc.2013.07.032
BindingDB Entry DOI: 10.7270/Q27P90TV