BDBM50442273 CHEMBL2442139
SMILES: CC(Sc1cc(cnc1N)-c1ccc(OCC(=O)N2CCOCC2)cc1)c1c(Cl)ccc(F)c1Cl
InChI Key: InChIKey=MATXBOHKVHFZKW-UHFFFAOYSA-N
Data: 1 IC50
Activity Spreadsheet -- Enzyme Inhibition Constant Data from BindingDB
Found 1 hit for monomerid = 50442273
Trg + Lig
Ki
nM
ΔG°
kcal/mole
IC50
nM
Kd
nM
EC50/IC50
nM
koff
s-1
kon
M-1s-1
pHTemp
°C
Hepatocyte growth factor receptor
(Homo sapiens (Human))
BDBM50442273
(CHEMBL2442139)
Show SMILES CC(Sc1cc(cnc1N)-c1ccc(OCC(=O)N2CCOCC2)cc1)c1c(Cl)ccc(F)c1Cl
Show InChI InChI=1S/C25H24Cl2FN3O3S/c1-15(23-19(26)6-7-20(28)24(23)27)35-21-12-17(13-30-25(21)29)16-2-4-18(5-3-16)34-14-22(32)31-8-10-33-11-9-31/h2-7,12-13,15H,8-11,14H2,1H3,(H2,29,30)
n/an/a 51n/an/an/an/an/an/a
Chinese Academy of Sciences
Curated by ChEMBL
Assay Description
Inhibition of c-Met (unknown origin) using poly (Glu, Tyr) 4:1 as substrate after 60 mins by ELISA
Bioorg Med Chem 21: 6804-20 (2013)
Article DOI: 10.1016/j.bmc.2013.07.032
BindingDB Entry DOI: 10.7270/Q27P90TV