BDBM50442275 CHEMBL2442137
SMILES: CC(Sc1cc(cnc1N)-c1ccc(nc1)N1CCOCC1)c1c(Cl)ccc(F)c1Cl
InChI Key: InChIKey=ZGOWOWJGXGJLNV-UHFFFAOYSA-N
Data: 1 IC50
Activity Spreadsheet -- Enzyme Inhibition Constant Data from BindingDB
Found 1 hit for monomerid = 50442275
Trg + Lig
Ki
nM
ΔG°
kcal/mole
IC50
nM
Kd
nM
EC50/IC50
nM
koff
s-1
kon
M-1s-1
pHTemp
°C
Hepatocyte growth factor receptor
(Homo sapiens (Human))
BDBM50442275
(CHEMBL2442137)
Show SMILES CC(Sc1cc(cnc1N)-c1ccc(nc1)N1CCOCC1)c1c(Cl)ccc(F)c1Cl
Show InChI InChI=1S/C22H21Cl2FN4OS/c1-13(20-16(23)3-4-17(25)21(20)24)31-18-10-15(12-28-22(18)26)14-2-5-19(27-11-14)29-6-8-30-9-7-29/h2-5,10-13H,6-9H2,1H3,(H2,26,28)
n/an/a 66n/an/an/an/an/an/a
Chinese Academy of Sciences
Curated by ChEMBL
Assay Description
Inhibition of c-Met (unknown origin) using poly (Glu, Tyr) 4:1 as substrate after 60 mins by ELISA
Bioorg Med Chem 21: 6804-20 (2013)
Article DOI: 10.1016/j.bmc.2013.07.032
BindingDB Entry DOI: 10.7270/Q27P90TV