BDBM50442301 CHEMBL2442748
SMILES: Cc1c(CC(O)=O)c2cccnc2n1Cc1ccc(cc1)S(C)=O
InChI Key: InChIKey=DNGTZZLWXYWZHA-UHFFFAOYSA-N
Data: 1 KI  2 IC50
Activity Spreadsheet -- Enzyme Inhibition Constant Data from BindingDB
Found 3 hits for monomerid = 50442301
Trg + Lig
Ki
nM
ΔG°
kcal/mole
IC50
nM
Kd
nM
EC50/IC50
nM
koff
s-1
kon
M-1s-1
pHTemp
°C
G protein-coupled receptor 44
(Homo sapiens (Human))
BDBM50442301
(CHEMBL2442748)
Show SMILES Cc1c(CC(O)=O)c2cccnc2n1Cc1ccc(cc1)S(C)=O
Show InChI InChI=1S/C18H18N2O3S/c1-12-16(10-17(21)22)15-4-3-9-19-18(15)20(12)11-13-5-7-14(8-6-13)24(2)23/h3-9H,10-11H2,1-2H3,(H,21,22)
Reactome pathway
249n/an/an/an/an/an/an/an/a
Novartis Institutes for Biomedical Research
Curated by ChEMBL
Assay Description
Displacement of [3H]-prostaglandin D2 from human CRTh2 receptor expressed in CHO cells after 2 hrs
Bioorg Med Chem 21: 6582-91 (2013)
Article DOI: 10.1016/j.bmc.2013.08.025
BindingDB Entry DOI: 10.7270/Q2QR4ZKF
G protein-coupled receptor 44
(Homo sapiens (Human))
BDBM50442301
(CHEMBL2442748)
Show SMILES Cc1c(CC(O)=O)c2cccnc2n1Cc1ccc(cc1)S(C)=O
Show InChI InChI=1S/C18H18N2O3S/c1-12-16(10-17(21)22)15-4-3-9-19-18(15)20(12)11-13-5-7-14(8-6-13)24(2)23/h3-9H,10-11H2,1-2H3,(H,21,22)
Reactome pathway
n/an/a 233n/an/an/an/an/an/a
Novartis Institutes for Biomedical Research
Curated by ChEMBL
Assay Description
Antagonist activity at CRTh2 receptor in human isolated eosinophil assessed as inhibition of DK-PGD2-induced shape change after 5 mins by flow cytome...
Bioorg Med Chem 21: 6582-91 (2013)
Article DOI: 10.1016/j.bmc.2013.08.025
BindingDB Entry DOI: 10.7270/Q2QR4ZKF
G protein-coupled receptor 44
(Homo sapiens (Human))
BDBM50442301
(CHEMBL2442748)
Show SMILES Cc1c(CC(O)=O)c2cccnc2n1Cc1ccc(cc1)S(C)=O
Show InChI InChI=1S/C18H18N2O3S/c1-12-16(10-17(21)22)15-4-3-9-19-18(15)20(12)11-13-5-7-14(8-6-13)24(2)23/h3-9H,10-11H2,1-2H3,(H,21,22)
Reactome pathway
n/an/a 51n/an/an/an/an/an/a
Novartis Institutes for Biomedical Research
Curated by ChEMBL
Assay Description
Antagonist activity at CRTh2 receptor in human isolated eosinophil assessed as inhibition of DK-PGD2-induced shape change after 5 mins by flow cytome...
Bioorg Med Chem 21: 6582-91 (2013)
Article DOI: 10.1016/j.bmc.2013.08.025
BindingDB Entry DOI: 10.7270/Q2QR4ZKF