BDBM50442373 CHEMBL2442920
SMILES: CC(C(=O)NCc1ccc(nc1SCC1CCCCC1)C(F)(F)F)c1ccc(NS(C)(=O)=O)c(F)c1
InChI Key: InChIKey=ARJVQJZAWVZUKV-UHFFFAOYSA-N
Data: 1 KI  1 IC50
Activity Spreadsheet -- Enzyme Inhibition Constant Data from BindingDB
Found 2 hits for monomerid = 50442373
Trg + Lig
Ki
nM
ΔG°
kcal/mole
IC50
nM
Kd
nM
EC50/IC50
nM
koff
s-1
kon
M-1s-1
pHTemp
°C
Transient receptor potential cation channel subfamily V member 1
(Homo sapiens (Human))
BDBM50442373
(CHEMBL2442920)
Show SMILES CC(C(=O)NCc1ccc(nc1SCC1CCCCC1)C(F)(F)F)c1ccc(NS(C)(=O)=O)c(F)c1
Show InChI InChI=1S/C24H29F4N3O3S2/c1-15(17-8-10-20(19(25)12-17)31-36(2,33)34)22(32)29-13-18-9-11-21(24(26,27)28)30-23(18)35-14-16-6-4-3-5-7-16/h8-12,15-16,31H,3-7,13-14H2,1-2H3,(H,29,32)
Reactome pathway
2.30n/an/an/an/an/an/an/an/a
Seoul National University
Curated by ChEMBL
Assay Description
Antagonist activity at human TRPV1 expressed in CHOK1 cells assessed as inhibition of capsaicin-induced activity by FLIPR assay
Bioorg Med Chem 21: 6657-64 (2013)
Article DOI: 10.1016/j.bmc.2013.08.015
BindingDB Entry DOI: 10.7270/Q26Q1ZPN
Transient receptor potential cation channel subfamily V member 1
(Homo sapiens (Human))
BDBM50442373
(CHEMBL2442920)
Show SMILES CC(C(=O)NCc1ccc(nc1SCC1CCCCC1)C(F)(F)F)c1ccc(NS(C)(=O)=O)c(F)c1
Show InChI InChI=1S/C24H29F4N3O3S2/c1-15(17-8-10-20(19(25)12-17)31-36(2,33)34)22(32)29-13-18-9-11-21(24(26,27)28)30-23(18)35-14-16-6-4-3-5-7-16/h8-12,15-16,31H,3-7,13-14H2,1-2H3,(H,29,32)
Reactome pathway
n/an/a 254n/an/an/an/an/an/a
Seoul National University
Curated by ChEMBL
Assay Description
Antagonist activity at human TRPV1 expressed in CHOK1 cells assessed as inhibition of pH-induced activity by FLIPR assay
Bioorg Med Chem 21: 6657-64 (2013)
Article DOI: 10.1016/j.bmc.2013.08.015
BindingDB Entry DOI: 10.7270/Q26Q1ZPN