BDBM50442390 CHEMBL2442897
SMILES: CC(C)CCSc1nc(ccc1CNC(=O)C(C)c1ccc(NS(C)(=O)=O)c(F)c1)C(F)(F)F
InChI Key: InChIKey=CPXMQOGFICWLSN-UHFFFAOYSA-N
Data: 1 KI  1 IC50
Activity Spreadsheet -- Enzyme Inhibition Constant Data from BindingDB
Found 2 hits for monomerid = 50442390
Trg + Lig
Ki
nM
ΔG°
kcal/mole
IC50
nM
Kd
nM
EC50/IC50
nM
koff
s-1
kon
M-1s-1
pHTemp
°C
Transient receptor potential cation channel subfamily V member 1
(Homo sapiens (Human))
BDBM50442390
(CHEMBL2442897)
Show SMILES CC(C)CCSc1nc(ccc1CNC(=O)C(C)c1ccc(NS(C)(=O)=O)c(F)c1)C(F)(F)F
Show InChI InChI=1S/C22H27F4N3O3S2/c1-13(2)9-10-33-21-16(6-8-19(28-21)22(24,25)26)12-27-20(30)14(3)15-5-7-18(17(23)11-15)29-34(4,31)32/h5-8,11,13-14,29H,9-10,12H2,1-4H3,(H,27,30)
Reactome pathway
0.700n/an/an/an/an/an/an/an/a
Seoul National University
Curated by ChEMBL
Assay Description
Antagonist activity at human TRPV1 expressed in CHOK1 cells assessed as inhibition of capsaicin-induced activity by FLIPR assay
Bioorg Med Chem 21: 6657-64 (2013)
Article DOI: 10.1016/j.bmc.2013.08.015
BindingDB Entry DOI: 10.7270/Q26Q1ZPN
Transient receptor potential cation channel subfamily V member 1
(Homo sapiens (Human))
BDBM50442390
(CHEMBL2442897)
Show SMILES CC(C)CCSc1nc(ccc1CNC(=O)C(C)c1ccc(NS(C)(=O)=O)c(F)c1)C(F)(F)F
Show InChI InChI=1S/C22H27F4N3O3S2/c1-13(2)9-10-33-21-16(6-8-19(28-21)22(24,25)26)12-27-20(30)14(3)15-5-7-18(17(23)11-15)29-34(4,31)32/h5-8,11,13-14,29H,9-10,12H2,1-4H3,(H,27,30)
Reactome pathway
n/an/a 82n/an/an/an/an/an/a
Seoul National University
Curated by ChEMBL
Assay Description
Antagonist activity at human TRPV1 expressed in CHOK1 cells assessed as inhibition of pH-induced activity by FLIPR assay
Bioorg Med Chem 21: 6657-64 (2013)
Article DOI: 10.1016/j.bmc.2013.08.015
BindingDB Entry DOI: 10.7270/Q26Q1ZPN