null
SMILES: O[C@H]1CC2(CCN(CC2)C(=O)Nc2ccc(OC(F)(F)F)cc2)Oc2c(F)cccc12
InChI Key: InChIKey=BXXQDSBIEKSNGM-KRWDZBQOSA-N
Activity Spreadsheet -- Enzyme Inhibition Constant Data from BindingDB
Found 2 hits for monomerid = 50442409
Trg + Lig
Ki
nM
ΔG°
kcal/mole
IC50
nM
Kd
nM
EC50/IC50
nM
koff
s-1
kon
M-1s-1
pHTemp
°C
Transient receptor potential cation channel subfamily M member 8
(Homo sapiens (Human))
BDBM50442409
(CHEMBL2443078)
Show SMILES O[C@H]1CC2(CCN(CC2)C(=O)Nc2ccc(OC(F)(F)F)cc2)Oc2c(F)cccc12 |r|
Show InChI InChI=1S/C21H20F4N2O4/c22-16-3-1-2-15-17(28)12-20(31-18(15)16)8-10-27(11-9-20)19(29)26-13-4-6-14(7-5-13)30-21(23,24)25/h1-7,17,28H,8-12H2,(H,26,29)/t17-/m0/s1
n/an/a 94n/an/an/an/an/an/a
Glenmark Pharmaceuticals Ltd.
Curated by ChEMBL
Assay Description
Antagonist activity at human TRPM8 expressed in CHO cells assessed as inhibition of icilin-induced 45Ca2+ uptake incubated for 10 mins prior to icili...
Bioorg Med Chem 21: 6542-53 (2013)
Article DOI: 10.1016/j.bmc.2013.08.031
BindingDB Entry DOI: 10.7270/Q2TH8P5S
Transient receptor potential cation channel subfamily V member 1
(Homo sapiens (Human))
BDBM50442409
(CHEMBL2443078)
Show SMILES O[C@H]1CC2(CCN(CC2)C(=O)Nc2ccc(OC(F)(F)F)cc2)Oc2c(F)cccc12 |r|
Show InChI InChI=1S/C21H20F4N2O4/c22-16-3-1-2-15-17(28)12-20(31-18(15)16)8-10-27(11-9-20)19(29)26-13-4-6-14(7-5-13)30-21(23,24)25/h1-7,17,28H,8-12H2,(H,26,29)/t17-/m0/s1
Reactome pathway
n/an/a 266n/an/an/an/an/an/a
Glenmark Pharmaceuticals Ltd.
Curated by ChEMBL
Assay Description
Antagonist activity at human TRPV1 expressed in CHO cells assessed as inhibition of capsaicin-induced 45Ca2+ uptake incubated for 10 mins prior to ca...
Bioorg Med Chem 21: 6542-53 (2013)
Article DOI: 10.1016/j.bmc.2013.08.031
BindingDB Entry DOI: 10.7270/Q2TH8P5S