null
SMILES: CCc1ccc(Cc2cc(ccc2C)[C@@H]2O[C@H]([C@H](O)CO)[C@H](O)[C@H]2O)cc1
InChI Key: InChIKey=MLHQBFISQGOVKQ-CSEOROSGSA-N
Activity Spreadsheet -- Enzyme Inhibition Constant Data from BindingDB
Found 2 hits for monomerid = 50442474
Trg + Lig
Ki
nM
ΔG°
kcal/mole
IC50
nM
Kd
nM
EC50/IC50
nM
koff
s-1
kon
M-1s-1
pHTemp
°C
Sodium/glucose cotransporter 2
(Homo sapiens (Human))
BDBM50442474
(CHEMBL2440367)
Show SMILES CCc1ccc(Cc2cc(ccc2C)[C@@H]2O[C@H]([C@H](O)CO)[C@H](O)[C@H]2O)cc1 |r|
Show InChI InChI=1S/C22H28O5/c1-3-14-5-7-15(8-6-14)10-17-11-16(9-4-13(17)2)21-19(25)20(26)22(27-21)18(24)12-23/h4-9,11,18-26H,3,10,12H2,1-2H3/t18-,19-,20-,21+,22-/m1/s1
n/an/an/an/a 2.50E+3n/an/an/an/a
National Taiwan University
Curated by ChEMBL
Assay Description
Inhibition of human SGLT2 expressed in CHO-K1 cells assessed as inhibition of [14C]-AMG uptake up to 120 mins by scintillation counting method
Bioorg Med Chem 21: 6282-91 (2013)
Article DOI: 10.1016/j.bmc.2013.08.067
BindingDB Entry DOI: 10.7270/Q29G5P80
Sodium/glucose cotransporter 1
(Homo sapiens (Human))
BDBM50442474
(CHEMBL2440367)
Show SMILES CCc1ccc(Cc2cc(ccc2C)[C@@H]2O[C@H]([C@H](O)CO)[C@H](O)[C@H]2O)cc1 |r|
Show InChI InChI=1S/C22H28O5/c1-3-14-5-7-15(8-6-14)10-17-11-16(9-4-13(17)2)21-19(25)20(26)22(27-21)18(24)12-23/h4-9,11,18-26H,3,10,12H2,1-2H3/t18-,19-,20-,21+,22-/m1/s1
n/an/an/an/a>5.00E+4n/an/an/an/a
National Taiwan University
Curated by ChEMBL
Assay Description
Inhibition of human SGLT1 expressed in CHO-K1 cells assessed as inhibition of [14C]-AMG uptake up to 120 mins by scintillation counting method
Bioorg Med Chem 21: 6282-91 (2013)
Article DOI: 10.1016/j.bmc.2013.08.067
BindingDB Entry DOI: 10.7270/Q29G5P80