BDBM50442483 CHEMBL2440375
SMILES: OC[C@@H](O)[C@H]1O[C@H]([C@H](O)[C@H]1O)c1ccc(Cl)c(Cc2ccc(F)cc2)c1
InChI Key: InChIKey=QDSZXOCDHGKUNN-IEWDOMPSSA-N
Data: 1 EC50
Activity Spreadsheet -- Enzyme Inhibition Constant Data from BindingDB
Found 1 hit for monomerid = 50442483
Trg + Lig
Ki
nM
ΔG°
kcal/mole
IC50
nM
Kd
nM
EC50/IC50
nM
koff
s-1
kon
M-1s-1
pHTemp
°C
Sodium/glucose cotransporter 2
(Homo sapiens (Human))
BDBM50442483
(CHEMBL2440375)
Show SMILES OC[C@@H](O)[C@H]1O[C@H]([C@H](O)[C@H]1O)c1ccc(Cl)c(Cc2ccc(F)cc2)c1 |r|
Show InChI InChI=1S/C19H20ClFO5/c20-14-6-3-11(8-12(14)7-10-1-4-13(21)5-2-10)18-16(24)17(25)19(26-18)15(23)9-22/h1-6,8,15-19,22-25H,7,9H2/t15-,16-,17-,18+,19-/m1/s1
n/an/an/an/a>5.00E+4n/an/an/an/a
National Taiwan University
Curated by ChEMBL
Assay Description
Inhibition of human SGLT2 expressed in CHO-K1 cells assessed as inhibition of [14C]-AMG uptake up to 120 mins by scintillation counting method
Bioorg Med Chem 21: 6282-91 (2013)
Article DOI: 10.1016/j.bmc.2013.08.067
BindingDB Entry DOI: 10.7270/Q29G5P80