null
SMILES: O=C(Cc1ccc(cc1)-n1cnnn1)N1CCN(CCc2ccc3nonc3c2)CC1
InChI Key: InChIKey=OMDQMYACEIXKDK-UHFFFAOYSA-N
Activity Spreadsheet -- Enzyme Inhibition Constant Data from BindingDB
Found 1 hit for monomerid = 50442601
Trg + Lig
Ki
nM
ΔG°
kcal/mole
IC50
nM
Kd
nM
EC50/IC50
nM
koff
s-1
kon
M-1s-1
pHTemp
°C
ATP-sensitive inward rectifier potassium channel 1
(Homo sapiens (Human))
BDBM50442601
(CHEMBL2441436)
Show SMILES O=C(Cc1ccc(cc1)-n1cnnn1)N1CCN(CCc2ccc3nonc3c2)CC1
Show InChI InChI=1S/C21H22N8O2/c30-21(14-16-1-4-18(5-2-16)29-15-22-25-26-29)28-11-9-27(10-12-28)8-7-17-3-6-19-20(13-17)24-31-23-19/h1-6,13,15H,7-12,14H2
Reactome pathway
n/an/a 160n/an/an/an/an/an/a
Merck Research Laboratories
Curated by ChEMBL
Assay Description
Inhibition of human ROMK channel-mediated 86Rb+ flux expressed in CHO cells after 35 mins by scintillation counting analysis
Bioorg Med Chem Lett 23: 5829-32 (2013)
Article DOI: 10.1016/j.bmcl.2013.08.104
BindingDB Entry DOI: 10.7270/Q28K7BHG