BDBM50442603 CHEMBL2441434
SMILES: O=C(Cc1ccc(cc1)-n1cnnn1)N1CCN(CCc2ccc(cc2)C#N)CC1
InChI Key: InChIKey=HXTQUDYQICAAJV-UHFFFAOYSA-N
Data: 1 IC50
Activity Spreadsheet -- Enzyme Inhibition Constant Data from BindingDB
Found 1 hit for monomerid = 50442603
Trg + Lig
Ki
nM
ΔG°
kcal/mole
IC50
nM
Kd
nM
EC50/IC50
nM
koff
s-1
kon
M-1s-1
pHTemp
°C
ATP-sensitive inward rectifier potassium channel 1
(Homo sapiens (Human))
BDBM50442603
(CHEMBL2441434)
Show SMILES O=C(Cc1ccc(cc1)-n1cnnn1)N1CCN(CCc2ccc(cc2)C#N)CC1
Show InChI InChI=1S/C22H23N7O/c23-16-20-3-1-18(2-4-20)9-10-27-11-13-28(14-12-27)22(30)15-19-5-7-21(8-6-19)29-17-24-25-26-29/h1-8,17H,9-15H2
Reactome pathway
n/an/a 920n/an/an/an/an/an/a
Merck Research Laboratories
Curated by ChEMBL
Assay Description
Inhibition of human ROMK channel-mediated 86Rb+ flux expressed in CHO cells after 35 mins by scintillation counting analysis
Bioorg Med Chem Lett 23: 5829-32 (2013)
Article DOI: 10.1016/j.bmcl.2013.08.104
BindingDB Entry DOI: 10.7270/Q28K7BHG