BDBM50442604 CHEMBL2441433
SMILES: [O-][N+](=O)c1ccc(CCN2CCN(CC2)C(=O)Cc2ccc(cc2)-n2cnnn2)cc1
InChI Key: InChIKey=VWVVYFJIUBMXBZ-UHFFFAOYSA-N
Data: 1 IC50
Activity Spreadsheet -- Enzyme Inhibition Constant Data from BindingDB
Found 1 hit for monomerid = 50442604
Trg + Lig
Ki
nM
ΔG°
kcal/mole
IC50
nM
Kd
nM
EC50/IC50
nM
koff
s-1
kon
M-1s-1
pHTemp
°C
ATP-sensitive inward rectifier potassium channel 1
(Homo sapiens (Human))
BDBM50442604
(CHEMBL2441433)
Show SMILES [O-][N+](=O)c1ccc(CCN2CCN(CC2)C(=O)Cc2ccc(cc2)-n2cnnn2)cc1
Show InChI InChI=1S/C21H23N7O3/c29-21(15-18-3-5-19(6-4-18)27-16-22-23-24-27)26-13-11-25(12-14-26)10-9-17-1-7-20(8-2-17)28(30)31/h1-8,16H,9-15H2
Reactome pathway
n/an/a 110n/an/an/an/an/an/a
Merck Research Laboratories
Curated by ChEMBL
Assay Description
Inhibition of human ROMK channel-mediated 86Rb+ flux expressed in CHO cells after 35 mins by scintillation counting analysis
Bioorg Med Chem Lett 23: 5829-32 (2013)
Article DOI: 10.1016/j.bmcl.2013.08.104
BindingDB Entry DOI: 10.7270/Q28K7BHG