BDBM50442612 CHEMBL2441426
SMILES: Cc1cc(CCN2CCN(CC2)C(=O)Cc2ccc(cc2)-n2cnnn2)cc2COC(=O)c12
InChI Key: InChIKey=LOAYDOHVFZLCRR-UHFFFAOYSA-N
Data: 1 IC50
Activity Spreadsheet -- Enzyme Inhibition Constant Data from BindingDB
Found 1 hit for monomerid = 50442612
Trg + Lig
Ki
nM
ΔG°
kcal/mole
IC50
nM
Kd
nM
EC50/IC50
nM
koff
s-1
kon
M-1s-1
pHTemp
°C
ATP-sensitive inward rectifier potassium channel 1
(Homo sapiens (Human))
BDBM50442612
(CHEMBL2441426)
Show SMILES Cc1cc(CCN2CCN(CC2)C(=O)Cc2ccc(cc2)-n2cnnn2)cc2COC(=O)c12
Show InChI InChI=1S/C24H26N6O3/c1-17-12-19(13-20-15-33-24(32)23(17)20)6-7-28-8-10-29(11-9-28)22(31)14-18-2-4-21(5-3-18)30-16-25-26-27-30/h2-5,12-13,16H,6-11,14-15H2,1H3
Reactome pathway
n/an/a 1.10E+3n/an/an/an/an/an/a
Merck Research Laboratories
Curated by ChEMBL
Assay Description
Inhibition of human ROMK channel-mediated 86Rb+ flux expressed in CHO cells after 35 mins by scintillation counting analysis
Bioorg Med Chem Lett 23: 5829-32 (2013)
Article DOI: 10.1016/j.bmcl.2013.08.104
BindingDB Entry DOI: 10.7270/Q28K7BHG