BDBM50442678 CHEMBL2442303
SMILES: NCCNc1ccn2ncc(-c3ccc4scnc4c3)c2n1
InChI Key: InChIKey=ZOUDTZOMWZWKMO-UHFFFAOYSA-N
Data: 2 IC50
Activity Spreadsheet -- Enzyme Inhibition Constant Data from BindingDB
Found 2 hits for monomerid = 50442678
Trg + Lig
Ki
nM
ΔG°
kcal/mole
IC50
nM
Kd
nM
EC50/IC50
nM
koff
s-1
kon
M-1s-1
pHTemp
°C
Serine/threonine-protein kinase pim-1
(Homo sapiens (Human))
BDBM50442678
(CHEMBL2442303)
Show SMILES NCCNc1ccn2ncc(-c3ccc4scnc4c3)c2n1
Show InChI InChI=1S/C15H14N6S/c16-4-5-17-14-3-6-21-15(20-14)11(8-19-21)10-1-2-13-12(7-10)18-9-22-13/h1-3,6-9H,4-5,16H2,(H,17,20)
n/an/a 7n/an/an/an/an/an/a
Merck Research Laboratories
Curated by ChEMBL
Assay Description
Inhibition of Pim1 (unknown origin) using STK3 as substrate preincubated for 30 mins followed by substrate and ATP addition after 45 mins by HTRF ass...
Bioorg Med Chem Lett 23: 6178-82 (2013)
Article DOI: 10.1016/j.bmcl.2013.08.110
BindingDB Entry DOI: 10.7270/Q2MS3V69
Serine/threonine-protein kinase pim-2
(Homo sapiens (Human))
BDBM50442678
(CHEMBL2442303)
Show SMILES NCCNc1ccn2ncc(-c3ccc4scnc4c3)c2n1
Show InChI InChI=1S/C15H14N6S/c16-4-5-17-14-3-6-21-15(20-14)11(8-19-21)10-1-2-13-12(7-10)18-9-22-13/h1-3,6-9H,4-5,16H2,(H,17,20)
n/an/a 212n/an/an/an/an/an/a
Merck Research Laboratories
Curated by ChEMBL
Assay Description
Inhibition of Pim2 (unknown origin) using STK1 as substrate preincubated for 30 mins followed by substrate and ATP addition after 60 mins by HTRF ass...
Bioorg Med Chem Lett 23: 6178-82 (2013)
Article DOI: 10.1016/j.bmcl.2013.08.110
BindingDB Entry DOI: 10.7270/Q2MS3V69