BDBM50442715 CHEMBL2442513
SMILES: OC(=O)c1cc2ccc(OCc3ccccc3)cc2oc1=O
InChI Key: InChIKey=LDBVFHSYVJZKOL-UHFFFAOYSA-N
Data: 1 IC50
Activity Spreadsheet -- Enzyme Inhibition Constant Data from BindingDB
Found 1 hit for monomerid = 50442715
Trg + Lig
Ki
nM
ΔG°
kcal/mole
IC50
nM
Kd
nM
EC50/IC50
nM
koff
s-1
kon
M-1s-1
pHTemp
°C
Monocarboxylate transporter 4
(Homo sapiens (Human))
BDBM50442715
(CHEMBL2442513)
Show SMILES OC(=O)c1cc2ccc(OCc3ccccc3)cc2oc1=O
Show InChI InChI=1S/C17H12O5/c18-16(19)14-8-12-6-7-13(9-15(12)22-17(14)20)21-10-11-4-2-1-3-5-11/h1-9H,10H2,(H,18,19)
Reactome pathway
n/an/a 1.90E+3n/an/an/an/an/an/a
Institut de Recherche Exp£rimentale et Clinique (IREC)
Curated by ChEMBL
Assay Description
Inhibition of MCT4-mediated [14C]-lactate uptake in human SiHa cells in lactate-containing medium assessed as remaining lactate concentration in cult...
Bioorg Med Chem 21: 7107-17 (2013)
Article DOI: 10.1016/j.bmc.2013.09.010
BindingDB Entry DOI: 10.7270/Q2H133G8