BDBM50442736 CHEMBL2442692
SMILES: COc1cc(cc(OC)c1O)[C@H]1[C@@H]2[C@H](COC2=O)[C@H](Nc2cccc(OCCCCCCCC(=O)NO)c2)c2cc3OCOc3cc12
InChI Key: InChIKey=YOVLDSYJIOXDAH-SRWWWFMASA-N
Data: 1 IC50
Activity Spreadsheet -- Enzyme Inhibition Constant Data from BindingDB
Found 1 hit for monomerid = 50442736
Trg + Lig
Ki
nM
ΔG°
kcal/mole
IC50
nM
Kd
nM
EC50/IC50
nM
koff
s-1
kon
M-1s-1
pHTemp
°C
Histone deacetylase 3
(Homo sapiens (Human))
BDBM50442736
(CHEMBL2442692)
Show SMILES COc1cc(cc(OC)c1O)[C@H]1[C@@H]2[C@H](COC2=O)[C@H](Nc2cccc(OCCCCCCCC(=O)NO)c2)c2cc3OCOc3cc12 |r|
Show InChI InChI=1S/C35H40N2O10/c1-42-28-13-20(14-29(43-2)34(28)39)31-23-16-26-27(47-19-46-26)17-24(23)33(25-18-45-35(40)32(25)31)36-21-9-8-10-22(15-21)44-12-7-5-3-4-6-11-30(38)37-41/h8-10,13-17,25,31-33,36,39,41H,3-7,11-12,18-19H2,1-2H3,(H,37,38)/t25-,31+,32-,33+/m0/s1
NCI pathway
Reactome pathway
n/an/a 69n/an/an/an/an/an/a
East China Normal University
Curated by ChEMBL
Assay Description
Inhibition of human recombinant HDAC3 expressed in baculovirus infected insect high5 cells using Ac-Lys-Tyr-Lys (epsilon-acetyl)-AMC as substrate aft...
Bioorg Med Chem 21: 6981-95 (2013)
Article DOI: 10.1016/j.bmc.2013.09.023
BindingDB Entry DOI: 10.7270/Q2CC124T