BDBM50442916 CHEMBL3039264
SMILES: CC(=O)O[C@H]1CC[C@@]2(C)C3CC[C@]4(C)[C@H](OC(=O)C=C4[C@@]3(C)[C@@H](CC2C1(C)C)OC(C)=O)c1ccoc1
InChI Key: InChIKey=HNFPPWVGLWDXQQ-JXSKQKFNSA-N
Data: 2 KI
Activity Spreadsheet -- Enzyme Inhibition Constant Data from BindingDB
Found 2 hits for monomerid = 50442916
Trg + Lig
Ki
nM
ΔG°
kcal/mole
IC50
nM
Kd
nM
EC50/IC50
nM
koff
s-1
kon
M-1s-1
pHTemp
°C
Solute carrier organic anion transporter family member 1B1 (OATP1B1)
(Homo sapiens (Human))
BDBM50442916
(CHEMBL3039264)
Show SMILES CC(=O)O[C@H]1CC[C@@]2(C)C3CC[C@]4(C)[C@H](OC(=O)C=C4[C@@]3(C)[C@@H](CC2C1(C)C)OC(C)=O)c1ccoc1 |r,c:18|
Show InChI InChI=1S/C30H40O7/c1-17(31)35-23-9-12-28(5)20-8-11-29(6)22(15-25(33)37-26(29)19-10-13-34-16-19)30(20,7)24(36-18(2)32)14-21(28)27(23,3)4/h10,13,15-16,20-21,23-24,26H,8-9,11-12,14H2,1-7H3/t20?,21?,23-,24+,26+,28-,29-,30-/m0/s1
410n/an/an/an/an/an/an/an/a
KU Leuven
Curated by ChEMBL
Assay Description
Ki values for sodium fluorescein (10 uM) uptake in OATP1B1-transfected CHO cells
Mol Pharmacol 83: 1257-67 (2013)
Article DOI: 10.1124/mol.112.084152
BindingDB Entry DOI: 10.7270/Q2TB18BP
Solute carrier organic anion transporter family member 1B3 (OATP1B3)
(Homo sapiens (Human))
BDBM50442916
(CHEMBL3039264)
Show SMILES CC(=O)O[C@H]1CC[C@@]2(C)C3CC[C@]4(C)[C@H](OC(=O)C=C4[C@@]3(C)[C@@H](CC2C1(C)C)OC(C)=O)c1ccoc1 |r,c:18|
Show InChI InChI=1S/C30H40O7/c1-17(31)35-23-9-12-28(5)20-8-11-29(6)22(15-25(33)37-26(29)19-10-13-34-16-19)30(20,7)24(36-18(2)32)14-21(28)27(23,3)4/h10,13,15-16,20-21,23-24,26H,8-9,11-12,14H2,1-7H3/t20?,21?,23-,24+,26+,28-,29-,30-/m0/s1
2.67E+3n/an/an/an/an/an/an/an/a
KU Leuven
Curated by ChEMBL
Assay Description
Ki values for sodium fluorescein (10 uM) uptake in OATP1B3-transfected CHO cells
Mol Pharmacol 83: 1257-67 (2013)
Article DOI: 10.1124/mol.112.084152
BindingDB Entry DOI: 10.7270/Q2TB18BP