BDBM50442985 CHEMBL3086865
SMILES: Nc1nc2[nH]c(CCCCCCC(=O)N[C@@H](CCC(O)=O)C(O)=O)cc2c(=O)[nH]1
InChI Key: InChIKey=YFTJOYZLYVUUOD-LBPRGKRZSA-N
Data: 1 IC50
PDB links: 1 PDB ID matches this monomer.
Activity Spreadsheet -- Enzyme Inhibition Constant Data from BindingDB
Found 1 hit for monomerid = 50442985
Trg + Lig
Ki
nM
ΔG°
kcal/mole
IC50
nM
Kd
nM
EC50/IC50
nM
koff
s-1
kon
M-1s-1
pHTemp
°C
Glycinamide ribonucleotide formyltransferase (GARFTase)
(Homo sapiens (Human))
BDBM50442985
(CHEMBL3086865)
Show SMILES Nc1nc2[nH]c(CCCCCCC(=O)N[C@@H](CCC(O)=O)C(O)=O)cc2c(=O)[nH]1 |r|
Show InChI InChI=1S/C18H25N5O6/c19-18-22-15-11(16(27)23-18)9-10(20-15)5-3-1-2-4-6-13(24)21-12(17(28)29)7-8-14(25)26/h9,12H,1-8H2,(H,21,24)(H,25,26)(H,28,29)(H4,19,20,22,23,27)/t12-/m0/s1
n/an/a 2.90n/an/an/an/an/an/a
Duquesne University
Curated by ChEMBL
Assay Description
In situ inhibition of GRAFTase in human KB cells assessed as incorporation of [14C]-glycine into [14C]-formyl GAR preincubated for 30 mins followed b...
J Med Chem 56: 8684-95 (2013)
Article DOI: 10.1021/jm401139z
BindingDB Entry DOI: 10.7270/Q21V5GDM
3D
3D Structure (crystal)