BDBM50443187 CHEMBL3086328
SMILES: COc1ccc(cc1)[C@H]1C[C@@H]1C(=O)Nc1nc2ccc(cc2s1)-c1cc[nH]c(=O)c1
InChI Key: InChIKey=OWOIXIRTYGMKDQ-MSOLQXFVSA-N
Data: 1 KI  1 IC50
Activity Spreadsheet -- Enzyme Inhibition Constant Data from BindingDB
Found 2 hits for monomerid = 50443187
Trg + Lig
Ki
nM
ΔG°
kcal/mole
IC50
nM
Kd
nM
EC50/IC50
nM
koff
s-1
kon
M-1s-1
pHTemp
°C
Tyrosine-protein kinase ITK/TSK
(Homo sapiens (Human))
BDBM50443187
(CHEMBL3086328)
Show SMILES COc1ccc(cc1)[C@H]1C[C@@H]1C(=O)Nc1nc2ccc(cc2s1)-c1cc[nH]c(=O)c1 |r|
Show InChI InChI=1S/C23H19N3O3S/c1-29-16-5-2-13(3-6-16)17-12-18(17)22(28)26-23-25-19-7-4-14(10-20(19)30-23)15-8-9-24-21(27)11-15/h2-11,17-18H,12H2,1H3,(H,24,27)(H,25,26,28)/t17-,18+/m1/s1
Reactome pathway
6.60n/an/an/an/an/an/an/an/a
Evotec (UK) Ltd
Curated by ChEMBL
Assay Description
Inhibition of full length GST-tagged ITK (unknown origin) using Ac-EFPIYDFLPAKKK-NH2 as substrate after 35 mins by LC/MS analysis
Bioorg Med Chem Lett 23: 6331-5 (2013)
Article DOI: 10.1016/j.bmcl.2013.09.069
BindingDB Entry DOI: 10.7270/Q2GX4D16
Tyrosine-protein kinase ITK/TSK
(Homo sapiens (Human))
BDBM50443187
(CHEMBL3086328)
Show SMILES COc1ccc(cc1)[C@H]1C[C@@H]1C(=O)Nc1nc2ccc(cc2s1)-c1cc[nH]c(=O)c1 |r|
Show InChI InChI=1S/C23H19N3O3S/c1-29-16-5-2-13(3-6-16)17-12-18(17)22(28)26-23-25-19-7-4-14(10-20(19)30-23)15-8-9-24-21(27)11-15/h2-11,17-18H,12H2,1H3,(H,24,27)(H,25,26,28)/t17-,18+/m1/s1
Reactome pathway
n/an/a>2.00E+4n/an/an/an/an/an/a
Evotec (UK) Ltd
Curated by ChEMBL
Assay Description
Inhibition of ITK in human Jurkat cells assessed as inhibition of PLC-gamma1 phosphorylation by immuno-detection assay
Bioorg Med Chem Lett 23: 6331-5 (2013)
Article DOI: 10.1016/j.bmcl.2013.09.069
BindingDB Entry DOI: 10.7270/Q2GX4D16