BDBM50443347 CHEMBL3086041::US8669252, 28
SMILES: Fc1ccc(nc1)C(NC(=O)[C@@H]1CC[C@H](C[C@H]1c1ccc(Br)cc1)N1CCOCC1)c1ccc(Cl)cc1
InChI Key: InChIKey=GZCPBKYTXSPNQJ-OCYUSGCXSA-N
Data: 3 IC50
Activity Spreadsheet -- Enzyme Inhibition Constant Data from BindingDB
Found 3 hits for monomerid = 50443347
Trg + Lig
Ki
nM
ΔG°
kcal/mole
IC50
nM
Kd
nM
EC50/IC50
nM
koff
s-1
kon
M-1s-1
pHTemp
°C
Prolylcarboxypeptidase (PRCP)
(Homo sapiens (Human))
BDBM50443347
(CHEMBL3086041 | US8669252, 28)
Show SMILES Fc1ccc(nc1)C(NC(=O)[C@@H]1CC[C@H](C[C@H]1c1ccc(Br)cc1)N1CCOCC1)c1ccc(Cl)cc1 |r|
Show InChI InChI=1S/C29H30BrClFN3O2/c30-21-5-1-19(2-6-21)26-17-24(35-13-15-37-16-14-35)10-11-25(26)29(36)34-28(20-3-7-22(31)8-4-20)27-12-9-23(32)18-33-27/h1-9,12,18,24-26,28H,10-11,13-17H2,(H,34,36)/t24-,25-,26+,28?/m1/s1
Reactome pathway
US Patent
n/an/a 0.950n/an/an/an/an/an/a
Merck Sharp & Dohme Corp.
US Patent
Assay Description
The potency of compounds of formula I against PrCP was determined by a fluorescence intensity kinetic assay measuring the IC50 values of PrCP inhibit...
US Patent US8669252 (2014)
BindingDB Entry DOI: 10.7270/Q2J9652X
Prolylcarboxypeptidase (PRCP)
(Homo sapiens (Human))
BDBM50443347
(CHEMBL3086041 | US8669252, 28)
Show SMILES Fc1ccc(nc1)C(NC(=O)[C@@H]1CC[C@H](C[C@H]1c1ccc(Br)cc1)N1CCOCC1)c1ccc(Cl)cc1 |r|
Show InChI InChI=1S/C29H30BrClFN3O2/c30-21-5-1-19(2-6-21)26-17-24(35-13-15-37-16-14-35)10-11-25(26)29(36)34-28(20-3-7-22(31)8-4-20)27-12-9-23(32)18-33-27/h1-9,12,18,24-26,28H,10-11,13-17H2,(H,34,36)/t24-,25-,26+,28?/m1/s1
Reactome pathway
n/an/a 0.950n/an/an/an/an/an/a
Merck Research Laboratories
Curated by ChEMBL
Assay Description
Inhibition of recombinant human PrCP using Mca-Ala-Pro-Lys(Dnp)-OH as substrate measured for 30 mins by fluorescence assay
Bioorg Med Chem Lett 23: 6228-33 (2013)
Article DOI: 10.1016/j.bmcl.2013.09.094
BindingDB Entry DOI: 10.7270/Q2DZ09Q4
Lysosomal Pro-X carboxypeptidase
(Mus musculus)
BDBM50443347
(CHEMBL3086041 | US8669252, 28)
Show SMILES Fc1ccc(nc1)C(NC(=O)[C@@H]1CC[C@H](C[C@H]1c1ccc(Br)cc1)N1CCOCC1)c1ccc(Cl)cc1 |r|
Show InChI InChI=1S/C29H30BrClFN3O2/c30-21-5-1-19(2-6-21)26-17-24(35-13-15-37-16-14-35)10-11-25(26)29(36)34-28(20-3-7-22(31)8-4-20)27-12-9-23(32)18-33-27/h1-9,12,18,24-26,28H,10-11,13-17H2,(H,34,36)/t24-,25-,26+,28?/m1/s1
Reactome pathway
n/an/a 1.70n/an/an/an/an/an/a
Merck Research Laboratories
Curated by ChEMBL
Assay Description
Inhibition of recombinant mouse PrCP using Mca-Ala-Pro-Lys(Dnp)-OH as substrate measured for 30 mins by fluorescence assay
Bioorg Med Chem Lett 23: 6228-33 (2013)
Article DOI: 10.1016/j.bmcl.2013.09.094
BindingDB Entry DOI: 10.7270/Q2DZ09Q4