BDBM50443353 CHEMBL3086036::US8669252, 14
SMILES: Fc1ccc(cc1)C(NC(=O)[C@@H]1CC[C@H](C[C@H]1c1ccc(Br)cc1)N1CCOCC1)c1ccc(F)cc1
InChI Key: InChIKey=WOSGPVNODROINW-FCEKVYKBSA-N
Data: 3 IC50
Activity Spreadsheet -- Enzyme Inhibition Constant Data from BindingDB
Found 3 hits for monomerid = 50443353
Trg + Lig
Ki
nM
ΔG°
kcal/mole
IC50
nM
Kd
nM
EC50/IC50
nM
koff
s-1
kon
M-1s-1
pHTemp
°C
Prolylcarboxypeptidase (PRCP)
(Homo sapiens (Human))
BDBM50443353
(CHEMBL3086036 | US8669252, 14)
Show SMILES Fc1ccc(cc1)C(NC(=O)[C@@H]1CC[C@H](C[C@H]1c1ccc(Br)cc1)N1CCOCC1)c1ccc(F)cc1 |r|
Show InChI InChI=1S/C30H31BrF2N2O2/c31-23-7-1-20(2-8-23)28-19-26(35-15-17-37-18-16-35)13-14-27(28)30(36)34-29(21-3-9-24(32)10-4-21)22-5-11-25(33)12-6-22/h1-12,26-29H,13-19H2,(H,34,36)/t26-,27-,28+/m1/s1
Reactome pathway
US Patent
n/an/a 1.40n/an/an/an/an/an/a
Merck Sharp & Dohme Corp.
US Patent
Assay Description
The potency of compounds of formula I against PrCP was determined by a fluorescence intensity kinetic assay measuring the IC50 values of PrCP inhibit...
US Patent US8669252 (2014)
BindingDB Entry DOI: 10.7270/Q2J9652X
Prolylcarboxypeptidase (PRCP)
(Homo sapiens (Human))
BDBM50443353
(CHEMBL3086036 | US8669252, 14)
Show SMILES Fc1ccc(cc1)C(NC(=O)[C@@H]1CC[C@H](C[C@H]1c1ccc(Br)cc1)N1CCOCC1)c1ccc(F)cc1 |r|
Show InChI InChI=1S/C30H31BrF2N2O2/c31-23-7-1-20(2-8-23)28-19-26(35-15-17-37-18-16-35)13-14-27(28)30(36)34-29(21-3-9-24(32)10-4-21)22-5-11-25(33)12-6-22/h1-12,26-29H,13-19H2,(H,34,36)/t26-,27-,28+/m1/s1
Reactome pathway
n/an/a 0.660n/an/an/an/an/an/a
Merck Research Laboratories
Curated by ChEMBL
Assay Description
Inhibition of recombinant human PrCP using Mca-Ala-Pro-Lys(Dnp)-OH as substrate measured for 30 mins by fluorescence assay
Bioorg Med Chem Lett 23: 6228-33 (2013)
Article DOI: 10.1016/j.bmcl.2013.09.094
BindingDB Entry DOI: 10.7270/Q2DZ09Q4
Lysosomal Pro-X carboxypeptidase
(Mus musculus)
BDBM50443353
(CHEMBL3086036 | US8669252, 14)
Show SMILES Fc1ccc(cc1)C(NC(=O)[C@@H]1CC[C@H](C[C@H]1c1ccc(Br)cc1)N1CCOCC1)c1ccc(F)cc1 |r|
Show InChI InChI=1S/C30H31BrF2N2O2/c31-23-7-1-20(2-8-23)28-19-26(35-15-17-37-18-16-35)13-14-27(28)30(36)34-29(21-3-9-24(32)10-4-21)22-5-11-25(33)12-6-22/h1-12,26-29H,13-19H2,(H,34,36)/t26-,27-,28+/m1/s1
Reactome pathway
n/an/a 1.40n/an/an/an/an/an/a
Merck Research Laboratories
Curated by ChEMBL
Assay Description
Inhibition of recombinant mouse PrCP using Mca-Ala-Pro-Lys(Dnp)-OH as substrate measured for 30 mins by fluorescence assay
Bioorg Med Chem Lett 23: 6228-33 (2013)
Article DOI: 10.1016/j.bmcl.2013.09.094
BindingDB Entry DOI: 10.7270/Q2DZ09Q4