BDBM50443586 CHEMBL3091975
SMILES: CS(=O)(=O)OC1C[C@@H]2CCCC[C@@H]2[C@H]1\C=C\c1ccc(cn1)-c1cccc(F)c1
InChI Key: InChIKey=WJCRFDMJISZXHA-DGRVINJVSA-N
Data: 2 IC50
Activity Spreadsheet -- Enzyme Inhibition Constant Data from BindingDB
Found 2 hits for monomerid = 50443586
Trg + Lig
Ki
nM
ΔG°
kcal/mole
IC50
nM
Kd
nM
EC50/IC50
nM
koff
s-1
kon
M-1s-1
pHTemp
°C
Proteinase-activated receptor 1
(Homo sapiens (Human))
BDBM50443586
(CHEMBL3091975)
Show SMILES CS(=O)(=O)OC1C[C@@H]2CCCC[C@@H]2[C@H]1\C=C\c1ccc(cn1)-c1cccc(F)c1 |r|
Show InChI InChI=1S/C23H26FNO3S/c1-29(26,27)28-23-14-17-5-2-3-8-21(17)22(23)12-11-20-10-9-18(15-25-20)16-6-4-7-19(24)13-16/h4,6-7,9-13,15,17,21-23H,2-3,5,8,14H2,1H3/b12-11+/t17-,21-,22+,23?/m0/s1
n/an/a 6.40n/an/an/an/an/an/a
Korea Research Institute of Technology
Curated by ChEMBL
Assay Description
Displacement of [3H]haTRAP from PAR1 in human platelet membranes after 60 mins by scintillation counting analysis
ACS Med Chem Lett 4: 1054-8 (2013)
Article DOI: 10.1021/ml400235c
BindingDB Entry DOI: 10.7270/Q2KH0PSN
Proteinase-activated receptor 1
(Homo sapiens (Human))
BDBM50443586
(CHEMBL3091975)
Show SMILES CS(=O)(=O)OC1C[C@@H]2CCCC[C@@H]2[C@H]1\C=C\c1ccc(cn1)-c1cccc(F)c1 |r|
Show InChI InChI=1S/C23H26FNO3S/c1-29(26,27)28-23-14-17-5-2-3-8-21(17)22(23)12-11-20-10-9-18(15-25-20)16-6-4-7-19(24)13-16/h4,6-7,9-13,15,17,21-23H,2-3,5,8,14H2,1H3/b12-11+/t17-,21-,22+,23?/m0/s1
n/an/a 6n/an/an/an/an/an/a
Korea Research Institute of Technology
Curated by ChEMBL
Assay Description
Antagonist activity at PAR1 in washed human platelets assessed as inhibition of haTRAP-induced platelet aggregation preincubated for 1 hr followed by...
ACS Med Chem Lett 4: 1054-8 (2013)
Article DOI: 10.1021/ml400235c
BindingDB Entry DOI: 10.7270/Q2KH0PSN