BDBM50443589 CHEMBL3091992
SMILES: CC1(O)C[C@@H]2CCCC[C@@H]2[C@H]1\C=C\c1ccc(cn1)-c1cccc(F)c1
InChI Key: InChIKey=CQJGCQVQOOMFHY-DGRVINJVSA-N
Data: 1 IC50
Activity Spreadsheet -- Enzyme Inhibition Constant Data from BindingDB
Found 1 hit for monomerid = 50443589
Trg + Lig
Ki
nM
ΔG°
kcal/mole
IC50
nM
Kd
nM
EC50/IC50
nM
koff
s-1
kon
M-1s-1
pHTemp
°C
Proteinase-activated receptor 1
(Homo sapiens (Human))
BDBM50443589
(CHEMBL3091992)
Show SMILES CC1(O)C[C@@H]2CCCC[C@@H]2[C@H]1\C=C\c1ccc(cn1)-c1cccc(F)c1 |r|
Show InChI InChI=1S/C23H26FNO/c1-23(26)14-17-5-2-3-8-21(17)22(23)12-11-20-10-9-18(15-25-20)16-6-4-7-19(24)13-16/h4,6-7,9-13,15,17,21-22,26H,2-3,5,8,14H2,1H3/b12-11+/t17-,21-,22+,23?/m0/s1
n/an/a 33n/an/an/an/an/an/a
Korea Research Institute of Technology
Curated by ChEMBL
Assay Description
Displacement of [3H]haTRAP from PAR1 in human platelet membranes after 60 mins by scintillation counting analysis
ACS Med Chem Lett 4: 1054-8 (2013)
Article DOI: 10.1021/ml400235c
BindingDB Entry DOI: 10.7270/Q2KH0PSN