BDBM50443604 CHEMBL3092198
SMILES: CC(C)(C1CCN(CC1)C(=O)c1cc(F)ccc1S(C)(=O)=O)S(=O)(=O)c1cccc(c1)C(F)(F)F
InChI Key: InChIKey=NLTKWBJFNLWOOZ-UHFFFAOYSA-N
Data: 1 EC50
Activity Spreadsheet -- Enzyme Inhibition Constant Data from BindingDB
Found 1 hit for monomerid = 50443604
Trg + Lig
Ki
nM
ΔG°
kcal/mole
IC50
nM
Kd
nM
EC50/IC50
nM
koff
s-1
kon
M-1s-1
pHTemp
°C
Pregnane X receptor
(Homo sapiens (Human))
BDBM50443604
(CHEMBL3092198)
Show SMILES CC(C)(C1CCN(CC1)C(=O)c1cc(F)ccc1S(C)(=O)=O)S(=O)(=O)c1cccc(c1)C(F)(F)F
Show InChI InChI=1S/C23H25F4NO5S2/c1-22(2,35(32,33)18-6-4-5-16(13-18)23(25,26)27)15-9-11-28(12-10-15)21(29)19-14-17(24)7-8-20(19)34(3,30)31/h4-8,13-15H,9-12H2,1-3H3
n/an/an/an/a 2.50E+3n/an/an/an/a
Merck Research Laboratories
Curated by ChEMBL
Assay Description
Activation of PXR (unknown origin)
ACS Med Chem Lett 4: 1064-8 (2013)
Article DOI: 10.1021/ml4002612
BindingDB Entry DOI: 10.7270/Q2FT8NHJ