BDBM50443611 CHEMBL3092203
SMILES: CS(=O)(=O)c1ccc(C(=O)N2CCC(CC2)N(C2CC2)S(=O)(=O)c2cccc(c2)C(F)(F)F)c(F)c1
InChI Key: InChIKey=LQTYPGGHNGTXPA-UHFFFAOYSA-N
Data: 1 EC50
Activity Spreadsheet -- Enzyme Inhibition Constant Data from BindingDB
Found 1 hit for monomerid = 50443611
Trg + Lig
Ki
nM
ΔG°
kcal/mole
IC50
nM
Kd
nM
EC50/IC50
nM
koff
s-1
kon
M-1s-1
pHTemp
°C
Pregnane X receptor
(Homo sapiens (Human))
BDBM50443611
(CHEMBL3092203)
Show SMILES CS(=O)(=O)c1ccc(C(=O)N2CCC(CC2)N(C2CC2)S(=O)(=O)c2cccc(c2)C(F)(F)F)c(F)c1
Show InChI InChI=1S/C23H24F4N2O5S2/c1-35(31,32)18-7-8-20(21(24)14-18)22(30)28-11-9-17(10-12-28)29(16-5-6-16)36(33,34)19-4-2-3-15(13-19)23(25,26)27/h2-4,7-8,13-14,16-17H,5-6,9-12H2,1H3
n/an/an/an/a 6.80E+3n/an/an/an/a
Merck Research Laboratories
Curated by ChEMBL
Assay Description
Activation of PXR (unknown origin)
ACS Med Chem Lett 4: 1064-8 (2013)
Article DOI: 10.1021/ml4002612
BindingDB Entry DOI: 10.7270/Q2FT8NHJ