BDBM50443631 CHEMBL3092465::US9174993, 14::US9221828, 14
SMILES: Cc1n[nH]c2nc(cnc12)-c1ccc(NS(=O)(=O)c2cc(C)ccc2C#N)cc1
InChI Key: InChIKey=BJRYMGKNXLWDQJ-UHFFFAOYSA-N
Data: 6 IC50
Activity Spreadsheet -- Enzyme Inhibition Constant Data from BindingDB
Found 6 hits for monomerid = 50443631
Trg + Lig
Ki
nM
ΔG°
kcal/mole
IC50
nM
Kd
nM
EC50/IC50
nM
koff
s-1
kon
M-1s-1
pHTemp
°C
Serine/threonine-protein kinase Sgk1
(Homo sapiens (Human))
BDBM50443631
(CHEMBL3092465 | US9174993, 14 | US9221828, 14)
Show SMILES Cc1n[nH]c2nc(cnc12)-c1ccc(NS(=O)(=O)c2cc(C)ccc2C#N)cc1
Show InChI InChI=1S/C20H16N6O2S/c1-12-3-4-15(10-21)18(9-12)29(27,28)26-16-7-5-14(6-8-16)17-11-22-19-13(2)24-25-20(19)23-17/h3-9,11,26H,1-2H3,(H,23,24,25)
Reactome pathway
US Patent
n/an/a 3n/an/an/an/an/an/a
SANOFI
US Patent
Assay Description
The compounds were tested for serum and glucocorticoid-regulated kinase 1 (SGK-1) inhibitory activity in a substrate phosphorylation assay designed t...
US Patent US9174993 (2015)
BindingDB Entry DOI: 10.7270/Q2MK6BPF
Serine/threonine-protein kinase Sgk1
(Homo sapiens (Human))
BDBM50443631
(CHEMBL3092465 | US9174993, 14 | US9221828, 14)
Show SMILES Cc1n[nH]c2nc(cnc12)-c1ccc(NS(=O)(=O)c2cc(C)ccc2C#N)cc1
Show InChI InChI=1S/C20H16N6O2S/c1-12-3-4-15(10-21)18(9-12)29(27,28)26-16-7-5-14(6-8-16)17-11-22-19-13(2)24-25-20(19)23-17/h3-9,11,26H,1-2H3,(H,23,24,25)
Reactome pathway
US Patent
n/an/a 3n/an/an/an/a7.424
SANOFI
US Patent
Assay Description
The enzyme reaction was carried out in a buffer containing 25 mM Tris-HCl (pH 7.4), 5 mM MgCl2, 2 mM MnCl2, 2 mM DTT, and 0.03% bovine serum albumi...
US Patent US9221828 (2015)
BindingDB Entry DOI: 10.7270/Q2GX49DW
Serine/threonine-protein kinase Sgk1
(Homo sapiens (Human))
BDBM50443631
(CHEMBL3092465 | US9174993, 14 | US9221828, 14)
Show SMILES Cc1n[nH]c2nc(cnc12)-c1ccc(NS(=O)(=O)c2cc(C)ccc2C#N)cc1
Show InChI InChI=1S/C20H16N6O2S/c1-12-3-4-15(10-21)18(9-12)29(27,28)26-16-7-5-14(6-8-16)17-11-22-19-13(2)24-25-20(19)23-17/h3-9,11,26H,1-2H3,(H,23,24,25)
Reactome pathway
n/an/a 3n/an/an/an/an/an/a
Temple University School of Pharmacy
Curated by ChEMBL
Assay Description
Inhibition of recombinant human SGK-1 expressed in baculovirus expression system using (5(6)-carboxyfluorescein)-RPRAATF-NH2 as substrate preincubate...
ACS Med Chem Lett 4: 1022-4 (2013)
Article DOI: 10.1021/ml400389a
BindingDB Entry DOI: 10.7270/Q2XS5WVS
Serine/threonine-protein kinase Sgk1
(Homo sapiens (Human))
BDBM50443631
(CHEMBL3092465 | US9174993, 14 | US9221828, 14)
Show SMILES Cc1n[nH]c2nc(cnc12)-c1ccc(NS(=O)(=O)c2cc(C)ccc2C#N)cc1
Show InChI InChI=1S/C20H16N6O2S/c1-12-3-4-15(10-21)18(9-12)29(27,28)26-16-7-5-14(6-8-16)17-11-22-19-13(2)24-25-20(19)23-17/h3-9,11,26H,1-2H3,(H,23,24,25)
Reactome pathway
n/an/a 3n/an/an/an/an/an/a
Sanofi R&D
Curated by ChEMBL
Assay Description
Inhibition of human SGK1 using fluo-5(6)-carboxyfluorescein)-RPRAATF-NH2 fluorescently labeled peptide by substrate phosphorylation assay in presence...
ACS Med Chem Lett 6: 73-8 (2015)
Article DOI: 10.1021/ml5003376
BindingDB Entry DOI: 10.7270/Q28S4RJT
Serine/threonine-protein kinase Sgk1
(Homo sapiens (Human))
BDBM50443631
(CHEMBL3092465 | US9174993, 14 | US9221828, 14)
Show SMILES Cc1n[nH]c2nc(cnc12)-c1ccc(NS(=O)(=O)c2cc(C)ccc2C#N)cc1
Show InChI InChI=1S/C20H16N6O2S/c1-12-3-4-15(10-21)18(9-12)29(27,28)26-16-7-5-14(6-8-16)17-11-22-19-13(2)24-25-20(19)23-17/h3-9,11,26H,1-2H3,(H,23,24,25)
Reactome pathway
n/an/a 2.90E+3n/an/an/an/an/an/a
Temple University School of Pharmacy
Curated by ChEMBL
Assay Description
Inhibition of recombinant human SGK1 (S61 to L431, S422D) expressed in human U20S cells assessed as inhibition of GSK3beta phosphorylation after 6 hr...
ACS Med Chem Lett 4: 1022-4 (2013)
Article DOI: 10.1021/ml400389a
BindingDB Entry DOI: 10.7270/Q2XS5WVS
Serine/threonine-protein kinase Sgk1
(Homo sapiens (Human))
BDBM50443631
(CHEMBL3092465 | US9174993, 14 | US9221828, 14)
Show SMILES Cc1n[nH]c2nc(cnc12)-c1ccc(NS(=O)(=O)c2cc(C)ccc2C#N)cc1
Show InChI InChI=1S/C20H16N6O2S/c1-12-3-4-15(10-21)18(9-12)29(27,28)26-16-7-5-14(6-8-16)17-11-22-19-13(2)24-25-20(19)23-17/h3-9,11,26H,1-2H3,(H,23,24,25)
Reactome pathway
n/an/a 580n/an/an/an/an/an/a
Sanofi R&D
Curated by ChEMBL
Assay Description
Inhibition of human SGK1 using fluo-5(6)-carboxyfluorescein)-RPRAATF-NH2 fluorescently labeled peptide by substrate phosphorylation assay in presence...
ACS Med Chem Lett 6: 73-8 (2015)
Article DOI: 10.1021/ml5003376
BindingDB Entry DOI: 10.7270/Q28S4RJT