BDBM50443782 CHEMBL3092643
SMILES: C(Oc1ccc2CCN(CCc2c1)C1CCC1)c1ccccc1
InChI Key: InChIKey=IFLIPLANALCYLX-UHFFFAOYSA-N
Data: 1 IC50
Activity Spreadsheet -- Enzyme Inhibition Constant Data from BindingDB
Found 1 hit for monomerid = 50443782
Trg + Lig
Ki
nM
ΔG°
kcal/mole
IC50
nM
Kd
nM
EC50/IC50
nM
koff
s-1
kon
M-1s-1
pHTemp
°C
Cytochrome P450 2D6
(Homo sapiens (Human))
BDBM50443782
(CHEMBL3092643)
Show SMILES C(Oc1ccc2CCN(CCc2c1)C1CCC1)c1ccccc1
Show InChI InChI=1S/C21H25NO/c1-2-5-17(6-3-1)16-23-21-10-9-18-11-13-22(20-7-4-8-20)14-12-19(18)15-21/h1-3,5-6,9-10,15,20H,4,7-8,11-14,16H2
n/an/a 600n/an/an/an/an/an/a
GlaxoSmithKline R&D
Curated by ChEMBL
Assay Description
Inhibition of human CYP2D6
Bioorg Med Chem Lett 23: 6897-901 (2013)
Article DOI: 10.1016/j.bmcl.2013.09.089
BindingDB Entry DOI: 10.7270/Q2HM59X6