BDBM50443912 CHEMBL3091466
SMILES: Cc1cccc(C)c1NC(=O)c1ccc(Nc2ncc(C)c(n2)-c2ccncc2)cc1
InChI Key: InChIKey=JJVPSWKDHGPFEL-UHFFFAOYSA-N
Data: 1 IC50
Activity Spreadsheet -- Enzyme Inhibition Constant Data from BindingDB
Found 1 hit for monomerid = 50443912
Trg + Lig
Ki
nM
ΔG°
kcal/mole
IC50
nM
Kd
nM
EC50/IC50
nM
koff
s-1
kon
M-1s-1
pHTemp
°C
Sonic hedgehog protein
(Mus musculus (Mouse))
BDBM50443912
(CHEMBL3091466)
Show SMILES Cc1cccc(C)c1NC(=O)c1ccc(Nc2ncc(C)c(n2)-c2ccncc2)cc1
Show InChI InChI=1S/C25H23N5O/c1-16-5-4-6-17(2)22(16)29-24(31)20-7-9-21(10-8-20)28-25-27-15-18(3)23(30-25)19-11-13-26-14-12-19/h4-15H,1-3H3,(H,29,31)(H,27,28,30)
n/an/a 0.540n/an/an/an/an/an/a
Jiangsu Simcere Pharmaceutical Co. Ltd
Curated by ChEMBL
Assay Description
Inhibition of SHH signaling pathway in mouse NIH3T3 cells measured after 48 hrs by Gli-luciferase reporter assay
Bioorg Med Chem Lett 23: 6777-83 (2013)
Article DOI: 10.1016/j.bmcl.2013.10.022
BindingDB Entry DOI: 10.7270/Q2R49S7W