BDBM50443921 CHEMBL3091577
SMILES: Cc1cccc(C)c1NC(=O)c1ccc(Nc2ncc(C)c(n2)-c2ccc(OC(F)(F)F)cc2)cc1
InChI Key: InChIKey=DYMWFFRVGYCZCP-UHFFFAOYSA-N
Data: 1 IC50
Activity Spreadsheet -- Enzyme Inhibition Constant Data from BindingDB
Found 1 hit for monomerid = 50443921
Trg + Lig
Ki
nM
ΔG°
kcal/mole
IC50
nM
Kd
nM
EC50/IC50
nM
koff
s-1
kon
M-1s-1
pHTemp
°C
Sonic hedgehog protein
(Mus musculus (Mouse))
BDBM50443921
(CHEMBL3091577)
Show SMILES Cc1cccc(C)c1NC(=O)c1ccc(Nc2ncc(C)c(n2)-c2ccc(OC(F)(F)F)cc2)cc1
Show InChI InChI=1S/C27H23F3N4O2/c1-16-5-4-6-17(2)23(16)33-25(35)20-7-11-21(12-8-20)32-26-31-15-18(3)24(34-26)19-9-13-22(14-10-19)36-27(28,29)30/h4-15H,1-3H3,(H,33,35)(H,31,32,34)
n/an/a 1.30n/an/an/an/an/an/a
Jiangsu Simcere Pharmaceutical Co. Ltd
Curated by ChEMBL
Assay Description
Inhibition of SHH signaling pathway in mouse NIH3T3 cells measured after 48 hrs by Gli-luciferase reporter assay
Bioorg Med Chem Lett 23: 6777-83 (2013)
Article DOI: 10.1016/j.bmcl.2013.10.022
BindingDB Entry DOI: 10.7270/Q2R49S7W