BDBM50444031 CHEMBL3092518
SMILES: CC(NC(=O)CCc1nc2ccccc2c(=O)[nH]1)c1ccc(cc1)-n1ccnc1
InChI Key: InChIKey=CXFUNVLSNZEBDZ-UHFFFAOYSA-N
Data: 2 IC50
PDB links: 1 PDB ID matches this monomer.
Activity Spreadsheet -- Enzyme Inhibition Constant Data from BindingDB
Found 2 hits for monomerid = 50444031
Trg + Lig
Ki
nM
ΔG°
kcal/mole
IC50
nM
Kd
nM
EC50/IC50
nM
koff
s-1
kon
M-1s-1
pHTemp
°C
Protein mono-ADP-ribosyltransferase PARP3 [R100H]
(Homo sapiens (Human))
BDBM50444031
(CHEMBL3092518)
Show SMILES CC(NC(=O)CCc1nc2ccccc2c(=O)[nH]1)c1ccc(cc1)-n1ccnc1
Show InChI InChI=1S/C22H21N5O2/c1-15(16-6-8-17(9-7-16)27-13-12-23-14-27)24-21(28)11-10-20-25-19-5-3-2-4-18(19)22(29)26-20/h2-9,12-15H,10-11H2,1H3,(H,24,28)(H,25,26,29)
n/an/a 1.32E+4n/an/an/an/an/an/a
Ume£ University
Curated by ChEMBL
Assay Description
Inhibition of full length ATRD3 (unknown origin)
J Med Chem 56: 9556-68 (2014)
Article DOI: 10.1021/jm401394u
BindingDB Entry DOI: 10.7270/Q2Q52R32
3D
3D Structure (crystal)
Poly [ADP-ribose] polymerase 1
(Homo sapiens (Human))
BDBM50444031
(CHEMBL3092518)
Show SMILES CC(NC(=O)CCc1nc2ccccc2c(=O)[nH]1)c1ccc(cc1)-n1ccnc1
Show InChI InChI=1S/C22H21N5O2/c1-15(16-6-8-17(9-7-16)27-13-12-23-14-27)24-21(28)11-10-20-25-19-5-3-2-4-18(19)22(29)26-20/h2-9,12-15H,10-11H2,1H3,(H,24,28)(H,25,26,29)
n/an/a 450n/an/an/an/an/an/a
Ume£ University
Curated by ChEMBL
Assay Description
Inhibition of catalytic domain of ATRD1 (unknown origin)
J Med Chem 56: 9556-68 (2014)
Article DOI: 10.1021/jm401394u
BindingDB Entry DOI: 10.7270/Q2Q52R32