null
SMILES: CCCCNc1ncc(c(N[C@H]2CC[C@H](O)CC2)n1)-c1ccc(CNC2CC2)cn1
InChI Key: InChIKey=PWOIRDUWFWWFMT-WGSAOQKQSA-N
Activity Spreadsheet -- Enzyme Inhibition Constant Data from BindingDB
Found 3 hits for monomerid = 50444069
Trg + Lig
Ki
nM
ΔG°
kcal/mole
IC50
nM
Kd
nM
EC50/IC50
nM
koff
s-1
kon
M-1s-1
pHTemp
°C
Tyrosine-protein kinase receptor TYRO3
(Homo sapiens (Human))
BDBM50444069
(CHEMBL3092796)
Show SMILES CCCCNc1ncc(c(N[C@H]2CC[C@H](O)CC2)n1)-c1ccc(CNC2CC2)cn1 |r,wU:11.10,wD:14.14,(20.96,-58.36,;22.3,-57.6,;23.63,-58.37,;24.96,-57.6,;26.3,-58.37,;27.63,-57.6,;28.96,-58.37,;30.3,-57.6,;30.3,-56.05,;28.96,-55.28,;28.96,-53.74,;27.62,-52.98,;26.29,-53.75,;24.96,-52.98,;24.96,-51.43,;23.62,-50.66,;26.29,-50.67,;27.62,-51.43,;27.63,-56.06,;31.63,-55.27,;32.96,-56.04,;34.29,-55.27,;34.28,-53.73,;35.61,-52.95,;36.95,-53.72,;38.28,-52.94,;39.81,-52.93,;39.04,-51.6,;32.94,-52.96,;31.61,-53.74,)|
Show InChI InChI=1S/C23H34N6O/c1-2-3-12-24-23-27-15-20(22(29-23)28-18-7-9-19(30)10-8-18)21-11-4-16(14-26-21)13-25-17-5-6-17/h4,11,14-15,17-19,25,30H,2-3,5-10,12-13H2,1H3,(H2,24,27,28,29)/t18-,19-
n/an/a 33n/an/an/an/an/an/a
University of North Carolina at Chapel Hill
Curated by ChEMBL
Assay Description
Inhibition of Tyro-3 kinase (unknown origin) using 5-FAM-EFPIYDFLPAKKK-CONH2 as substrate after 180 mins by microfluidic capillary electrophoresis as...
J Med Chem 56: 9683-92 (2014)
Article DOI: 10.1021/jm401387j
BindingDB Entry DOI: 10.7270/Q29W0GX8
Tyrosine-protein kinase Mer
(Homo sapiens (Human))
BDBM50444069
(CHEMBL3092796)
Show SMILES CCCCNc1ncc(c(N[C@H]2CC[C@H](O)CC2)n1)-c1ccc(CNC2CC2)cn1 |r,wU:11.10,wD:14.14,(20.96,-58.36,;22.3,-57.6,;23.63,-58.37,;24.96,-57.6,;26.3,-58.37,;27.63,-57.6,;28.96,-58.37,;30.3,-57.6,;30.3,-56.05,;28.96,-55.28,;28.96,-53.74,;27.62,-52.98,;26.29,-53.75,;24.96,-52.98,;24.96,-51.43,;23.62,-50.66,;26.29,-50.67,;27.62,-51.43,;27.63,-56.06,;31.63,-55.27,;32.96,-56.04,;34.29,-55.27,;34.28,-53.73,;35.61,-52.95,;36.95,-53.72,;38.28,-52.94,;39.81,-52.93,;39.04,-51.6,;32.94,-52.96,;31.61,-53.74,)|
Show InChI InChI=1S/C23H34N6O/c1-2-3-12-24-23-27-15-20(22(29-23)28-18-7-9-19(30)10-8-18)21-11-4-16(14-26-21)13-25-17-5-6-17/h4,11,14-15,17-19,25,30H,2-3,5-10,12-13H2,1H3,(H2,24,27,28,29)/t18-,19-
Reactome pathway
n/an/a 1.30n/an/an/an/an/an/a
University of North Carolina at Chapel Hill
Curated by ChEMBL
Assay Description
Inhibition of Mer kinase (unknown origin) using 5-FAM-EFPIYDFLPAKKK-CONH2 as substrate after 180 mins by microfluidic capillary electrophoresis assay
J Med Chem 56: 9683-92 (2014)
Article DOI: 10.1021/jm401387j
BindingDB Entry DOI: 10.7270/Q29W0GX8
Tyrosine-protein kinase receptor UFO
(Homo sapiens (Human))
BDBM50444069
(CHEMBL3092796)
Show SMILES CCCCNc1ncc(c(N[C@H]2CC[C@H](O)CC2)n1)-c1ccc(CNC2CC2)cn1 |r,wU:11.10,wD:14.14,(20.96,-58.36,;22.3,-57.6,;23.63,-58.37,;24.96,-57.6,;26.3,-58.37,;27.63,-57.6,;28.96,-58.37,;30.3,-57.6,;30.3,-56.05,;28.96,-55.28,;28.96,-53.74,;27.62,-52.98,;26.29,-53.75,;24.96,-52.98,;24.96,-51.43,;23.62,-50.66,;26.29,-50.67,;27.62,-51.43,;27.63,-56.06,;31.63,-55.27,;32.96,-56.04,;34.29,-55.27,;34.28,-53.73,;35.61,-52.95,;36.95,-53.72,;38.28,-52.94,;39.81,-52.93,;39.04,-51.6,;32.94,-52.96,;31.61,-53.74,)|
Show InChI InChI=1S/C23H34N6O/c1-2-3-12-24-23-27-15-20(22(29-23)28-18-7-9-19(30)10-8-18)21-11-4-16(14-26-21)13-25-17-5-6-17/h4,11,14-15,17-19,25,30H,2-3,5-10,12-13H2,1H3,(H2,24,27,28,29)/t18-,19-
n/an/a 84n/an/an/an/an/an/a
University of North Carolina at Chapel Hill
Curated by ChEMBL
Assay Description
Inhibition of Axl kinase (unknown origin) using 5-FAM-KKKKEEIYFFF-CONH2 as substrate after 180 mins by microfluidic capillary electrophoresis assay
J Med Chem 56: 9683-92 (2014)
Article DOI: 10.1021/jm401387j
BindingDB Entry DOI: 10.7270/Q29W0GX8