BDBM50444079 CHEMBL3092806
SMILES: CCCCNc1ncc(c(N[C@H]2CC[C@H](O)CC2)n1)-c1ccc(CN2CCN(C)CC2)cn1
InChI Key: InChIKey=XYSYRHAUHUPOHK-MEMLXQNLSA-N
Data: 3 IC50
Activity Spreadsheet -- Enzyme Inhibition Constant Data from BindingDB
Found 3 hits for monomerid = 50444079
Trg + Lig
Ki
nM
ΔG°
kcal/mole
IC50
nM
Kd
nM
EC50/IC50
nM
koff
s-1
kon
M-1s-1
pHTemp
°C
Tyrosine-protein kinase receptor TYRO3
(Homo sapiens (Human))
BDBM50444079
(CHEMBL3092806)
Show SMILES CCCCNc1ncc(c(N[C@H]2CC[C@H](O)CC2)n1)-c1ccc(CN2CCN(C)CC2)cn1 |r,wU:11.10,wD:14.14,(37.6,-21.62,;38.94,-20.85,;40.27,-21.62,;41.6,-20.85,;42.94,-21.62,;44.27,-20.86,;45.61,-21.63,;46.94,-20.85,;46.94,-19.3,;45.6,-18.54,;45.6,-17,;44.26,-16.23,;42.94,-17.01,;41.6,-16.23,;41.6,-14.69,;40.26,-13.92,;42.93,-13.92,;44.26,-14.69,;44.27,-19.31,;48.27,-18.53,;49.6,-19.3,;50.93,-18.53,;50.92,-16.98,;52.25,-16.21,;53.59,-16.97,;53.59,-18.51,;54.92,-19.27,;56.25,-18.5,;57.59,-19.27,;56.25,-16.96,;54.91,-16.19,;49.58,-16.22,;48.25,-17,)|
Show InChI InChI=1S/C25H39N7O/c1-3-4-11-26-25-28-17-22(24(30-25)29-20-6-8-21(33)9-7-20)23-10-5-19(16-27-23)18-32-14-12-31(2)13-15-32/h5,10,16-17,20-21,33H,3-4,6-9,11-15,18H2,1-2H3,(H2,26,28,29,30)/t20-,21-
n/an/a 110n/an/an/an/an/an/a
University of North Carolina at Chapel Hill
Curated by ChEMBL
Assay Description
Inhibition of Tyro-3 kinase (unknown origin) using 5-FAM-EFPIYDFLPAKKK-CONH2 as substrate after 180 mins by microfluidic capillary electrophoresis as...
J Med Chem 56: 9683-92 (2014)
Article DOI: 10.1021/jm401387j
BindingDB Entry DOI: 10.7270/Q29W0GX8
Tyrosine-protein kinase Mer
(Homo sapiens (Human))
BDBM50444079
(CHEMBL3092806)
Show SMILES CCCCNc1ncc(c(N[C@H]2CC[C@H](O)CC2)n1)-c1ccc(CN2CCN(C)CC2)cn1 |r,wU:11.10,wD:14.14,(37.6,-21.62,;38.94,-20.85,;40.27,-21.62,;41.6,-20.85,;42.94,-21.62,;44.27,-20.86,;45.61,-21.63,;46.94,-20.85,;46.94,-19.3,;45.6,-18.54,;45.6,-17,;44.26,-16.23,;42.94,-17.01,;41.6,-16.23,;41.6,-14.69,;40.26,-13.92,;42.93,-13.92,;44.26,-14.69,;44.27,-19.31,;48.27,-18.53,;49.6,-19.3,;50.93,-18.53,;50.92,-16.98,;52.25,-16.21,;53.59,-16.97,;53.59,-18.51,;54.92,-19.27,;56.25,-18.5,;57.59,-19.27,;56.25,-16.96,;54.91,-16.19,;49.58,-16.22,;48.25,-17,)|
Show InChI InChI=1S/C25H39N7O/c1-3-4-11-26-25-28-17-22(24(30-25)29-20-6-8-21(33)9-7-20)23-10-5-19(16-27-23)18-32-14-12-31(2)13-15-32/h5,10,16-17,20-21,33H,3-4,6-9,11-15,18H2,1-2H3,(H2,26,28,29,30)/t20-,21-
Reactome pathway
n/an/a 3.90n/an/an/an/an/an/a
University of North Carolina at Chapel Hill
Curated by ChEMBL
Assay Description
Inhibition of Mer kinase (unknown origin) using 5-FAM-EFPIYDFLPAKKK-CONH2 as substrate after 180 mins by microfluidic capillary electrophoresis assay
J Med Chem 56: 9683-92 (2014)
Article DOI: 10.1021/jm401387j
BindingDB Entry DOI: 10.7270/Q29W0GX8
Tyrosine-protein kinase receptor UFO
(Homo sapiens (Human))
BDBM50444079
(CHEMBL3092806)
Show SMILES CCCCNc1ncc(c(N[C@H]2CC[C@H](O)CC2)n1)-c1ccc(CN2CCN(C)CC2)cn1 |r,wU:11.10,wD:14.14,(37.6,-21.62,;38.94,-20.85,;40.27,-21.62,;41.6,-20.85,;42.94,-21.62,;44.27,-20.86,;45.61,-21.63,;46.94,-20.85,;46.94,-19.3,;45.6,-18.54,;45.6,-17,;44.26,-16.23,;42.94,-17.01,;41.6,-16.23,;41.6,-14.69,;40.26,-13.92,;42.93,-13.92,;44.26,-14.69,;44.27,-19.31,;48.27,-18.53,;49.6,-19.3,;50.93,-18.53,;50.92,-16.98,;52.25,-16.21,;53.59,-16.97,;53.59,-18.51,;54.92,-19.27,;56.25,-18.5,;57.59,-19.27,;56.25,-16.96,;54.91,-16.19,;49.58,-16.22,;48.25,-17,)|
Show InChI InChI=1S/C25H39N7O/c1-3-4-11-26-25-28-17-22(24(30-25)29-20-6-8-21(33)9-7-20)23-10-5-19(16-27-23)18-32-14-12-31(2)13-15-32/h5,10,16-17,20-21,33H,3-4,6-9,11-15,18H2,1-2H3,(H2,26,28,29,30)/t20-,21-
n/an/a 260n/an/an/an/an/an/a
University of North Carolina at Chapel Hill
Curated by ChEMBL
Assay Description
Inhibition of Axl kinase (unknown origin) using 5-FAM-KKKKEEIYFFF-CONH2 as substrate after 180 mins by microfluidic capillary electrophoresis assay
J Med Chem 56: 9683-92 (2014)
Article DOI: 10.1021/jm401387j
BindingDB Entry DOI: 10.7270/Q29W0GX8