BDBM50444149 CHEMBL3093308
SMILES: OC(=O)c1cc(ccc1N1CC[C@@H](C1)OCC1CC1)C(F)(F)F
InChI Key: InChIKey=WCOPSKRHLIRJBK-LBPRGKRZSA-N
Data: 2 IC50
Activity Spreadsheet -- Enzyme Inhibition Constant Data from BindingDB
Found 2 hits for monomerid = 50444149
Trg + Lig
Ki
nM
ΔG°
kcal/mole
IC50
nM
Kd
nM
EC50/IC50
nM
koff
s-1
kon
M-1s-1
pHTemp
°C
Endothelial lipase
(Homo sapiens (Human))
BDBM50444149
(CHEMBL3093308)
Show SMILES OC(=O)c1cc(ccc1N1CC[C@@H](C1)OCC1CC1)C(F)(F)F |r|
Show InChI InChI=1S/C16H18F3NO3/c17-16(18,19)11-3-4-14(13(7-11)15(21)22)20-6-5-12(8-20)23-9-10-1-2-10/h3-4,7,10,12H,1-2,5-6,8-9H2,(H,21,22)/t12-/m0/s1
n/an/a 236n/an/an/an/an/an/a
Xenon Pharmaceuticals Inc
Curated by ChEMBL
Assay Description
Inhibition of recombinant human endothelial lipase using bis-BODIPY-FL C11-PC as substrate preincubated for 30 mins followed by substrate addition by...
Bioorg Med Chem 21: 7724-34 (2013)
Article DOI: 10.1016/j.bmc.2013.10.023
BindingDB Entry DOI: 10.7270/Q2P55PZ8
Lipoprotein lipase
(Homo sapiens (Human))
BDBM50444149
(CHEMBL3093308)
Show SMILES OC(=O)c1cc(ccc1N1CC[C@@H](C1)OCC1CC1)C(F)(F)F |r|
Show InChI InChI=1S/C16H18F3NO3/c17-16(18,19)11-3-4-14(13(7-11)15(21)22)20-6-5-12(8-20)23-9-10-1-2-10/h3-4,7,10,12H,1-2,5-6,8-9H2,(H,21,22)/t12-/m0/s1
Reactome pathway
n/an/a 4.99E+4n/an/an/an/an/an/a
Xenon Pharmaceuticals Inc
Curated by ChEMBL
Assay Description
Inhibition of recombinant human lipoprotein lipase using bis-BODIPY-FL C11-PC as substrate preincubated for 30 mins followed by substrate addition by...
Bioorg Med Chem 21: 7724-34 (2013)
Article DOI: 10.1016/j.bmc.2013.10.023
BindingDB Entry DOI: 10.7270/Q2P55PZ8