BDBM50444183 CHEMBL3093413
SMILES: O=C(Nc1nnc(o1)-c1ccccc1)N(CCC(c1ccccc1)c1ccccc1)CCN1CCOCC1
InChI Key: InChIKey=UCQJBAUFWHOQDV-UHFFFAOYSA-N
Data: 1 EC50
Activity Spreadsheet -- Enzyme Inhibition Constant Data from BindingDB
Found 1 hit for monomerid = 50444183
Trg + Lig
Ki
nM
ΔG°
kcal/mole
IC50
nM
Kd
nM
EC50/IC50
nM
koff
s-1
kon
M-1s-1
pHTemp
°C
Calcium-sensing receptor (CaSR)
(Homo sapiens (Human))
BDBM50444183
(CHEMBL3093413)
Show SMILES O=C(Nc1nnc(o1)-c1ccccc1)N(CCC(c1ccccc1)c1ccccc1)CCN1CCOCC1
Show InChI InChI=1S/C30H33N5O3/c36-30(31-29-33-32-28(38-29)26-14-8-3-9-15-26)35(19-18-34-20-22-37-23-21-34)17-16-27(24-10-4-1-5-11-24)25-12-6-2-7-13-25/h1-15,27H,16-23H2,(H,31,33,36)
n/an/an/an/a 1.03E+3n/an/an/an/a
Amgen Inc.
Curated by ChEMBL
Assay Description
Activation of human CaSR
Bioorg Med Chem Lett 23: 6625-8 (2013)
Article DOI: 10.1016/j.bmcl.2013.10.050
BindingDB Entry DOI: 10.7270/Q2JD4Z7Z