BDBM50444185 CHEMBL3093448
SMILES: Cc1cc(C)c(c(C)c1)S(=O)(=O)NC(Cc1c[nH]c2c(C)cccc12)C(F)(F)F
InChI Key: InChIKey=HMYGXGUMESBWOB-UHFFFAOYSA-N
Data: 4 IC50
Activity Spreadsheet -- Enzyme Inhibition Constant Data from BindingDB
Found 4 hits for monomerid = 50444185
Trg + Lig
Ki
nM
ΔG°
kcal/mole
IC50
nM
Kd
nM
EC50/IC50
nM
koff
s-1
kon
M-1s-1
pHTemp
°C
Glucocorticoid receptor
(Homo sapiens (Human))
BDBM50444185
(CHEMBL3093448)
Show SMILES Cc1cc(C)c(c(C)c1)S(=O)(=O)NC(Cc1c[nH]c2c(C)cccc12)C(F)(F)F
Show InChI InChI=1S/C21H23F3N2O2S/c1-12-8-14(3)20(15(4)9-12)29(27,28)26-18(21(22,23)24)10-16-11-25-19-13(2)6-5-7-17(16)19/h5-9,11,18,25-26H,10H2,1-4H3
n/an/a 20n/an/an/an/an/an/a
Boehringer Ingelheim Pharmaceuticals Inc.
Curated by ChEMBL
Assay Description
Displacement of TAMRA-labeled dexamethasone from glucocorticoid receptor (unknown origin) by fluorescence polarization competitive binding assay
Bioorg Med Chem Lett 23: 6640-4 (2013)
Article DOI: 10.1016/j.bmcl.2013.10.052
BindingDB Entry DOI: 10.7270/Q2DN46G5
Mineralocorticoid receptor
(Homo sapiens (Human))
BDBM50444185
(CHEMBL3093448)
Show SMILES Cc1cc(C)c(c(C)c1)S(=O)(=O)NC(Cc1c[nH]c2c(C)cccc12)C(F)(F)F
Show InChI InChI=1S/C21H23F3N2O2S/c1-12-8-14(3)20(15(4)9-12)29(27,28)26-18(21(22,23)24)10-16-11-25-19-13(2)6-5-7-17(16)19/h5-9,11,18,25-26H,10H2,1-4H3
n/an/a 90n/an/an/an/an/an/a
Boehringer Ingelheim Pharmaceuticals Inc.
Curated by ChEMBL
Assay Description
Binding affinity to mineralocorticoid receptor (unknown origin) by fluorescence polarization competitive binding assay
Bioorg Med Chem Lett 23: 6640-4 (2013)
Article DOI: 10.1016/j.bmcl.2013.10.052
BindingDB Entry DOI: 10.7270/Q2DN46G5
Progesterone receptor
(Homo sapiens (Human))
BDBM50444185
(CHEMBL3093448)
Show SMILES Cc1cc(C)c(c(C)c1)S(=O)(=O)NC(Cc1c[nH]c2c(C)cccc12)C(F)(F)F
Show InChI InChI=1S/C21H23F3N2O2S/c1-12-8-14(3)20(15(4)9-12)29(27,28)26-18(21(22,23)24)10-16-11-25-19-13(2)6-5-7-17(16)19/h5-9,11,18,25-26H,10H2,1-4H3
n/an/a 5.90E+3n/an/an/an/an/an/a
Boehringer Ingelheim Pharmaceuticals Inc.
Curated by ChEMBL
Assay Description
Displacement of TAMRA-labeled mifepristone from progesterone receptor (unknown origin) by fluorescence polarization competitive binding assay
Bioorg Med Chem Lett 23: 6640-4 (2013)
Article DOI: 10.1016/j.bmcl.2013.10.052
BindingDB Entry DOI: 10.7270/Q2DN46G5
Glucocorticoid receptor
(Homo sapiens (Human))
BDBM50444185
(CHEMBL3093448)
Show SMILES Cc1cc(C)c(c(C)c1)S(=O)(=O)NC(Cc1c[nH]c2c(C)cccc12)C(F)(F)F
Show InChI InChI=1S/C21H23F3N2O2S/c1-12-8-14(3)20(15(4)9-12)29(27,28)26-18(21(22,23)24)10-16-11-25-19-13(2)6-5-7-17(16)19/h5-9,11,18,25-26H,10H2,1-4H3
n/an/a>1.00E+4n/an/an/an/an/an/a
Boehringer Ingelheim Pharmaceuticals Inc.
Curated by ChEMBL
Assay Description
Agonist activity at glucocorticoid receptor in HFF assessed as inhibition of IL-1-induced IL-6 production after 24 hrs
Bioorg Med Chem Lett 23: 6640-4 (2013)
Article DOI: 10.1016/j.bmcl.2013.10.052
BindingDB Entry DOI: 10.7270/Q2DN46G5