null
SMILES: Cc1cc(C)c(c(C)c1)S(=O)(=O)NC(CNc1ccccc1)C(F)(F)F
InChI Key: InChIKey=PVUYPBAPWIWFAJ-UHFFFAOYSA-N
Activity Spreadsheet -- Enzyme Inhibition Constant Data from BindingDB
Found 4 hits for monomerid = 50444200
Trg + Lig
Ki
nM
ΔG°
kcal/mole
IC50
nM
Kd
nM
EC50/IC50
nM
koff
s-1
kon
M-1s-1
pHTemp
°C
Glucocorticoid receptor
(Homo sapiens (Human))
BDBM50444200
(CHEMBL3093458)
Show SMILES Cc1cc(C)c(c(C)c1)S(=O)(=O)NC(CNc1ccccc1)C(F)(F)F
Show InChI InChI=1S/C18H21F3N2O2S/c1-12-9-13(2)17(14(3)10-12)26(24,25)23-16(18(19,20)21)11-22-15-7-5-4-6-8-15/h4-10,16,22-23H,11H2,1-3H3
n/an/a>1.00E+4n/an/an/an/an/an/a
Boehringer Ingelheim Pharmaceuticals Inc.
Curated by ChEMBL
Assay Description
Agonist activity at glucocorticoid receptor in HFF assessed as inhibition of IL-1-induced IL-6 production after 24 hrs
Bioorg Med Chem Lett 23: 6640-4 (2013)
Article DOI: 10.1016/j.bmcl.2013.10.052
BindingDB Entry DOI: 10.7270/Q2DN46G5
Glucocorticoid receptor
(Homo sapiens (Human))
BDBM50444200
(CHEMBL3093458)
Show SMILES Cc1cc(C)c(c(C)c1)S(=O)(=O)NC(CNc1ccccc1)C(F)(F)F
Show InChI InChI=1S/C18H21F3N2O2S/c1-12-9-13(2)17(14(3)10-12)26(24,25)23-16(18(19,20)21)11-22-15-7-5-4-6-8-15/h4-10,16,22-23H,11H2,1-3H3
n/an/a 95n/an/an/an/an/an/a
Boehringer Ingelheim Pharmaceuticals Inc.
Curated by ChEMBL
Assay Description
Displacement of TAMRA-labeled dexamethasone from glucocorticoid receptor (unknown origin) by fluorescence polarization competitive binding assay
Bioorg Med Chem Lett 23: 6640-4 (2013)
Article DOI: 10.1016/j.bmcl.2013.10.052
BindingDB Entry DOI: 10.7270/Q2DN46G5
Mineralocorticoid receptor
(Homo sapiens (Human))
BDBM50444200
(CHEMBL3093458)
Show SMILES Cc1cc(C)c(c(C)c1)S(=O)(=O)NC(CNc1ccccc1)C(F)(F)F
Show InChI InChI=1S/C18H21F3N2O2S/c1-12-9-13(2)17(14(3)10-12)26(24,25)23-16(18(19,20)21)11-22-15-7-5-4-6-8-15/h4-10,16,22-23H,11H2,1-3H3
n/an/a 260n/an/an/an/an/an/a
Boehringer Ingelheim Pharmaceuticals Inc.
Curated by ChEMBL
Assay Description
Binding affinity to mineralocorticoid receptor (unknown origin) by fluorescence polarization competitive binding assay
Bioorg Med Chem Lett 23: 6640-4 (2013)
Article DOI: 10.1016/j.bmcl.2013.10.052
BindingDB Entry DOI: 10.7270/Q2DN46G5
Progesterone receptor
(Homo sapiens (Human))
BDBM50444200
(CHEMBL3093458)
Show SMILES Cc1cc(C)c(c(C)c1)S(=O)(=O)NC(CNc1ccccc1)C(F)(F)F
Show InChI InChI=1S/C18H21F3N2O2S/c1-12-9-13(2)17(14(3)10-12)26(24,25)23-16(18(19,20)21)11-22-15-7-5-4-6-8-15/h4-10,16,22-23H,11H2,1-3H3
n/an/a 3.20E+3n/an/an/an/an/an/a
Boehringer Ingelheim Pharmaceuticals Inc.
Curated by ChEMBL
Assay Description
Displacement of TAMRA-labeled mifepristone from progesterone receptor (unknown origin) by fluorescence polarization competitive binding assay
Bioorg Med Chem Lett 23: 6640-4 (2013)
Article DOI: 10.1016/j.bmcl.2013.10.052
BindingDB Entry DOI: 10.7270/Q2DN46G5