BDBM50444240 CHEMBL3093635
SMILES: CCCCNc1ncc(C(=O)Nc2ccc(cc2)S(=O)(=O)N2CCOCC2)c(N[C@H]2CC[C@H](N)CC2)n1
InChI Key: InChIKey=IJBQYPBBOUFSEN-WGSAOQKQSA-N
Data: 3 IC50
Activity Spreadsheet -- Enzyme Inhibition Constant Data from BindingDB
Found 3 hits for monomerid = 50444240
Trg + Lig
Ki
nM
ΔG°
kcal/mole
IC50
nM
Kd
nM
EC50/IC50
nM
koff
s-1
kon
M-1s-1
pHTemp
°C
Tyrosine-protein kinase Mer
(Homo sapiens (Human))
BDBM50444240
(CHEMBL3093635)
Show SMILES CCCCNc1ncc(C(=O)Nc2ccc(cc2)S(=O)(=O)N2CCOCC2)c(N[C@H]2CC[C@H](N)CC2)n1 |r,wU:29.30,wD:32.34,(.04,-21.39,;1.37,-20.63,;2.71,-21.4,;4.04,-20.63,;5.37,-21.4,;6.71,-20.63,;8.04,-21.4,;9.38,-20.63,;9.37,-19.08,;10.7,-18.3,;10.7,-16.76,;12.04,-19.07,;13.37,-18.29,;14.71,-19.07,;16.03,-18.29,;16.03,-16.75,;14.68,-15.99,;13.36,-16.76,;17.36,-15.97,;16.58,-14.63,;18.13,-14.62,;18.7,-16.74,;18.69,-18.27,;20.02,-19.03,;21.36,-18.26,;21.35,-16.72,;20.01,-15.95,;8.04,-18.32,;8.03,-16.78,;6.7,-16.01,;5.36,-16.79,;4.03,-16.01,;4.03,-14.47,;2.69,-13.7,;5.36,-13.71,;6.69,-14.47,;6.71,-19.09,)|
Show InChI InChI=1S/C25H37N7O4S/c1-2-3-12-27-25-28-17-22(23(31-25)29-19-6-4-18(26)5-7-19)24(33)30-20-8-10-21(11-9-20)37(34,35)32-13-15-36-16-14-32/h8-11,17-19H,2-7,12-16,26H2,1H3,(H,30,33)(H2,27,28,29,31)/t18-,19-
Reactome pathway
n/an/a 2.10n/an/an/an/an/an/a
Eshelman School of Pharmacy�Department of Pharmacology�Lineberger Compreh
Curated by ChEMBL
Assay Description
Inhibition of Mer kinase (unknown origin) using 5-FAM-EFPIYDFLPAKKK-CONH2 as substrate after 180 mins by microfluidic capillary electrophoresis assay
J Med Chem 56: 9693-700 (2014)
Article DOI: 10.1021/jm4013888
BindingDB Entry DOI: 10.7270/Q21G0NQ1
Tyrosine-protein kinase receptor UFO
(Homo sapiens (Human))
BDBM50444240
(CHEMBL3093635)
Show SMILES CCCCNc1ncc(C(=O)Nc2ccc(cc2)S(=O)(=O)N2CCOCC2)c(N[C@H]2CC[C@H](N)CC2)n1 |r,wU:29.30,wD:32.34,(.04,-21.39,;1.37,-20.63,;2.71,-21.4,;4.04,-20.63,;5.37,-21.4,;6.71,-20.63,;8.04,-21.4,;9.38,-20.63,;9.37,-19.08,;10.7,-18.3,;10.7,-16.76,;12.04,-19.07,;13.37,-18.29,;14.71,-19.07,;16.03,-18.29,;16.03,-16.75,;14.68,-15.99,;13.36,-16.76,;17.36,-15.97,;16.58,-14.63,;18.13,-14.62,;18.7,-16.74,;18.69,-18.27,;20.02,-19.03,;21.36,-18.26,;21.35,-16.72,;20.01,-15.95,;8.04,-18.32,;8.03,-16.78,;6.7,-16.01,;5.36,-16.79,;4.03,-16.01,;4.03,-14.47,;2.69,-13.7,;5.36,-13.71,;6.69,-14.47,;6.71,-19.09,)|
Show InChI InChI=1S/C25H37N7O4S/c1-2-3-12-27-25-28-17-22(23(31-25)29-19-6-4-18(26)5-7-19)24(33)30-20-8-10-21(11-9-20)37(34,35)32-13-15-36-16-14-32/h8-11,17-19H,2-7,12-16,26H2,1H3,(H,30,33)(H2,27,28,29,31)/t18-,19-
n/an/a 400n/an/an/an/an/an/a
Eshelman School of Pharmacy�Department of Pharmacology�Lineberger Compreh
Curated by ChEMBL
Assay Description
Inhibition of Axl kinase (unknown origin) using 5-FAM-KKKKEEIYFFF-CONH2 as substrate after 180 mins by microfluidic capillary electrophoresis assay
J Med Chem 56: 9693-700 (2014)
Article DOI: 10.1021/jm4013888
BindingDB Entry DOI: 10.7270/Q21G0NQ1
Tyrosine-protein kinase receptor TYRO3
(Homo sapiens (Human))
BDBM50444240
(CHEMBL3093635)
Show SMILES CCCCNc1ncc(C(=O)Nc2ccc(cc2)S(=O)(=O)N2CCOCC2)c(N[C@H]2CC[C@H](N)CC2)n1 |r,wU:29.30,wD:32.34,(.04,-21.39,;1.37,-20.63,;2.71,-21.4,;4.04,-20.63,;5.37,-21.4,;6.71,-20.63,;8.04,-21.4,;9.38,-20.63,;9.37,-19.08,;10.7,-18.3,;10.7,-16.76,;12.04,-19.07,;13.37,-18.29,;14.71,-19.07,;16.03,-18.29,;16.03,-16.75,;14.68,-15.99,;13.36,-16.76,;17.36,-15.97,;16.58,-14.63,;18.13,-14.62,;18.7,-16.74,;18.69,-18.27,;20.02,-19.03,;21.36,-18.26,;21.35,-16.72,;20.01,-15.95,;8.04,-18.32,;8.03,-16.78,;6.7,-16.01,;5.36,-16.79,;4.03,-16.01,;4.03,-14.47,;2.69,-13.7,;5.36,-13.71,;6.69,-14.47,;6.71,-19.09,)|
Show InChI InChI=1S/C25H37N7O4S/c1-2-3-12-27-25-28-17-22(23(31-25)29-19-6-4-18(26)5-7-19)24(33)30-20-8-10-21(11-9-20)37(34,35)32-13-15-36-16-14-32/h8-11,17-19H,2-7,12-16,26H2,1H3,(H,30,33)(H2,27,28,29,31)/t18-,19-
n/an/a 400n/an/an/an/an/an/a
Eshelman School of Pharmacy�Department of Pharmacology�Lineberger Compreh
Curated by ChEMBL
Assay Description
Inhibition of Tyro-3 kinase (unknown origin) using 5-FAM-EFPIYDFLPAKKK-CONH2 as substrate after 180 mins by microfluidic capillary electrophoresis as...
J Med Chem 56: 9693-700 (2014)
Article DOI: 10.1021/jm4013888
BindingDB Entry DOI: 10.7270/Q21G0NQ1