BDBM50444357 CHEMBL3094438
SMILES: Cc1ncc2cc(C(=O)Nc3cc(ccc3Cl)C(=O)NC(CCN)c3ccccc3)c(=O)[nH]c2n1
InChI Key: InChIKey=YBASBPWQGVPOIX-UHFFFAOYSA-N
Data: 2 IC50
Activity Spreadsheet -- Enzyme Inhibition Constant Data from BindingDB
Found 2 hits for monomerid = 50444357
Trg + Lig
Ki
nM
ΔG°
kcal/mole
IC50
nM
Kd
nM
EC50/IC50
nM
koff
s-1
kon
M-1s-1
pHTemp
°C
Dual-specificity tyrosine-regulated kinases 1B
(Homo sapiens (Human))
BDBM50444357
(CHEMBL3094438)
Show SMILES Cc1ncc2cc(C(=O)Nc3cc(ccc3Cl)C(=O)NC(CCN)c3ccccc3)c(=O)[nH]c2n1
Show InChI InChI=1S/C25H23ClN6O3/c1-14-28-13-17-11-18(25(35)32-22(17)29-14)24(34)31-21-12-16(7-8-19(21)26)23(33)30-20(9-10-27)15-5-3-2-4-6-15/h2-8,11-13,20H,9-10,27H2,1H3,(H,30,33)(H,31,34)(H,28,29,32,35)
n/an/a 18n/an/an/an/an/an/a
Hoffmann-La Roche Inc.
Curated by ChEMBL
Assay Description
Inhibition of DYRK1B (unknown origin)
Bioorg Med Chem Lett 23: 6610-5 (2013)
Article DOI: 10.1016/j.bmcl.2013.10.055
BindingDB Entry DOI: 10.7270/Q20G3MNJ
Dual-specificity tyrosine-phosphorylation regulated kinase 1A
(Homo sapiens (Human))
BDBM50444357
(CHEMBL3094438)
Show SMILES Cc1ncc2cc(C(=O)Nc3cc(ccc3Cl)C(=O)NC(CCN)c3ccccc3)c(=O)[nH]c2n1
Show InChI InChI=1S/C25H23ClN6O3/c1-14-28-13-17-11-18(25(35)32-22(17)29-14)24(34)31-21-12-16(7-8-19(21)26)23(33)30-20(9-10-27)15-5-3-2-4-6-15/h2-8,11-13,20H,9-10,27H2,1H3,(H,30,33)(H,31,34)(H,28,29,32,35)
Reactome pathway
n/an/a 37n/an/an/an/an/an/a
Hoffmann-La Roche Inc.
Curated by ChEMBL
Assay Description
Inhibition of DYRK1A (unknown origin)
Bioorg Med Chem Lett 23: 6610-5 (2013)
Article DOI: 10.1016/j.bmcl.2013.10.055
BindingDB Entry DOI: 10.7270/Q20G3MNJ