BDBM50444369 CHEMBL3094458
SMILES: COc1ncc2cc(C(=O)Nc3cc(ccc3Cl)C(=O)NCCCN)c(=O)[nH]c2n1
InChI Key: InChIKey=SYYAIOURHWVANM-UHFFFAOYSA-N
Data: 2 IC50
Activity Spreadsheet -- Enzyme Inhibition Constant Data from BindingDB
Found 2 hits for monomerid = 50444369
Trg + Lig
Ki
nM
ΔG°
kcal/mole
IC50
nM
Kd
nM
EC50/IC50
nM
koff
s-1
kon
M-1s-1
pHTemp
°C
Dual-specificity tyrosine-regulated kinases 1B
(Homo sapiens (Human))
BDBM50444369
(CHEMBL3094458)
Show SMILES COc1ncc2cc(C(=O)Nc3cc(ccc3Cl)C(=O)NCCCN)c(=O)[nH]c2n1
Show InChI InChI=1S/C19H19ClN6O4/c1-30-19-23-9-11-7-12(18(29)25-15(11)26-19)17(28)24-14-8-10(3-4-13(14)20)16(27)22-6-2-5-21/h3-4,7-9H,2,5-6,21H2,1H3,(H,22,27)(H,24,28)(H,23,25,26,29)
n/an/a 774n/an/an/an/an/an/a
Hoffmann-La Roche Inc.
Curated by ChEMBL
Assay Description
Inhibition of DYRK1B (unknown origin)
Bioorg Med Chem Lett 23: 6610-5 (2013)
Article DOI: 10.1016/j.bmcl.2013.10.055
BindingDB Entry DOI: 10.7270/Q20G3MNJ
Dual-specificity tyrosine-phosphorylation regulated kinase 1A
(Homo sapiens (Human))
BDBM50444369
(CHEMBL3094458)
Show SMILES COc1ncc2cc(C(=O)Nc3cc(ccc3Cl)C(=O)NCCCN)c(=O)[nH]c2n1
Show InChI InChI=1S/C19H19ClN6O4/c1-30-19-23-9-11-7-12(18(29)25-15(11)26-19)17(28)24-14-8-10(3-4-13(14)20)16(27)22-6-2-5-21/h3-4,7-9H,2,5-6,21H2,1H3,(H,22,27)(H,24,28)(H,23,25,26,29)
Reactome pathway
n/an/a 1.61E+3n/an/an/an/an/an/a
Hoffmann-La Roche Inc.
Curated by ChEMBL
Assay Description
Inhibition of DYRK1A (unknown origin)
Bioorg Med Chem Lett 23: 6610-5 (2013)
Article DOI: 10.1016/j.bmcl.2013.10.055
BindingDB Entry DOI: 10.7270/Q20G3MNJ