BDBM50444375 CHEMBL3094452
SMILES: COc1ncc2cc(C(=O)Nc3cc(ccc3Cl)C(=O)NCc3ccsc3)c(=O)[nH]c2n1
InChI Key: InChIKey=RQFGUPSBOAVFSQ-UHFFFAOYSA-N
Data: 2 IC50
Activity Spreadsheet -- Enzyme Inhibition Constant Data from BindingDB
Found 2 hits for monomerid = 50444375
Trg + Lig
Ki
nM
ΔG°
kcal/mole
IC50
nM
Kd
nM
EC50/IC50
nM
koff
s-1
kon
M-1s-1
pHTemp
°C
Dual-specificity tyrosine-regulated kinases 1B
(Homo sapiens (Human))
BDBM50444375
(CHEMBL3094452)
Show SMILES COc1ncc2cc(C(=O)Nc3cc(ccc3Cl)C(=O)NCc3ccsc3)c(=O)[nH]c2n1
Show InChI InChI=1S/C21H16ClN5O4S/c1-31-21-24-9-13-6-14(20(30)26-17(13)27-21)19(29)25-16-7-12(2-3-15(16)22)18(28)23-8-11-4-5-32-10-11/h2-7,9-10H,8H2,1H3,(H,23,28)(H,25,29)(H,24,26,27,30)
n/an/a 40n/an/an/an/an/an/a
Hoffmann-La Roche Inc.
Curated by ChEMBL
Assay Description
Inhibition of DYRK1B (unknown origin)
Bioorg Med Chem Lett 23: 6610-5 (2013)
Article DOI: 10.1016/j.bmcl.2013.10.055
BindingDB Entry DOI: 10.7270/Q20G3MNJ
Dual-specificity tyrosine-phosphorylation regulated kinase 1A
(Homo sapiens (Human))
BDBM50444375
(CHEMBL3094452)
Show SMILES COc1ncc2cc(C(=O)Nc3cc(ccc3Cl)C(=O)NCc3ccsc3)c(=O)[nH]c2n1
Show InChI InChI=1S/C21H16ClN5O4S/c1-31-21-24-9-13-6-14(20(30)26-17(13)27-21)19(29)25-16-7-12(2-3-15(16)22)18(28)23-8-11-4-5-32-10-11/h2-7,9-10H,8H2,1H3,(H,23,28)(H,25,29)(H,24,26,27,30)
Reactome pathway
n/an/a 30n/an/an/an/an/an/a
Hoffmann-La Roche Inc.
Curated by ChEMBL
Assay Description
Inhibition of DYRK1A (unknown origin)
Bioorg Med Chem Lett 23: 6610-5 (2013)
Article DOI: 10.1016/j.bmcl.2013.10.055
BindingDB Entry DOI: 10.7270/Q20G3MNJ