BDBM50444377 CHEMBL3094450
SMILES: COc1ncc2cc(C(=O)Nc3cc(ccc3Cl)C(=O)N(C)Cc3cccc(Cl)c3)c(=O)[nH]c2n1
InChI Key: InChIKey=OSGPGSKNNFIBDD-UHFFFAOYSA-N
Data: 2 IC50
Activity Spreadsheet -- Enzyme Inhibition Constant Data from BindingDB
Found 2 hits for monomerid = 50444377
Trg + Lig
Ki
nM
ΔG°
kcal/mole
IC50
nM
Kd
nM
EC50/IC50
nM
koff
s-1
kon
M-1s-1
pHTemp
°C
Dual-specificity tyrosine-regulated kinases 1B
(Homo sapiens (Human))
BDBM50444377
(CHEMBL3094450)
Show SMILES COc1ncc2cc(C(=O)Nc3cc(ccc3Cl)C(=O)N(C)Cc3cccc(Cl)c3)c(=O)[nH]c2n1
Show InChI InChI=1S/C24H19Cl2N5O4/c1-31(12-13-4-3-5-16(25)8-13)23(34)14-6-7-18(26)19(10-14)28-21(32)17-9-15-11-27-24(35-2)30-20(15)29-22(17)33/h3-11H,12H2,1-2H3,(H,28,32)(H,27,29,30,33)
n/an/a 586n/an/an/an/an/an/a
Hoffmann-La Roche Inc.
Curated by ChEMBL
Assay Description
Inhibition of DYRK1B (unknown origin)
Bioorg Med Chem Lett 23: 6610-5 (2013)
Article DOI: 10.1016/j.bmcl.2013.10.055
BindingDB Entry DOI: 10.7270/Q20G3MNJ
Dual-specificity tyrosine-phosphorylation regulated kinase 1A
(Homo sapiens (Human))
BDBM50444377
(CHEMBL3094450)
Show SMILES COc1ncc2cc(C(=O)Nc3cc(ccc3Cl)C(=O)N(C)Cc3cccc(Cl)c3)c(=O)[nH]c2n1
Show InChI InChI=1S/C24H19Cl2N5O4/c1-31(12-13-4-3-5-16(25)8-13)23(34)14-6-7-18(26)19(10-14)28-21(32)17-9-15-11-27-24(35-2)30-20(15)29-22(17)33/h3-11H,12H2,1-2H3,(H,28,32)(H,27,29,30,33)
Reactome pathway
n/an/a 305n/an/an/an/an/an/a
Hoffmann-La Roche Inc.
Curated by ChEMBL
Assay Description
Inhibition of DYRK1A (unknown origin)
Bioorg Med Chem Lett 23: 6610-5 (2013)
Article DOI: 10.1016/j.bmcl.2013.10.055
BindingDB Entry DOI: 10.7270/Q20G3MNJ