null
SMILES: Cc1nc(\C=C\c2ccccc2)c(C(O)=O)c(C(O)=O)c1O
InChI Key: InChIKey=UXEIPHRTFRCYLJ-BQYQJAHWSA-N
Activity Spreadsheet -- Enzyme Inhibition Constant Data from BindingDB
Found 2 hits for monomerid = 50444418
Trg + Lig
Ki
nM
ΔG°
kcal/mole
IC50
nM
Kd
nM
EC50/IC50
nM
koff
s-1
kon
M-1s-1
pHTemp
°C
P2X purinoceptor 1
(Mus musculus)
BDBM50444418
(CHEMBL3091606)
Show SMILES Cc1nc(\C=C\c2ccccc2)c(C(O)=O)c(C(O)=O)c1O
Show InChI InChI=1S/C16H13NO5/c1-9-14(18)13(16(21)22)12(15(19)20)11(17-9)8-7-10-5-3-2-4-6-10/h2-8,18H,1H3,(H,19,20)(H,21,22)/b8-7+
Reactome pathway
n/an/a 768n/an/an/an/an/an/a
Gwangju Institute of Science and Technology (GIST)
Curated by ChEMBL
Assay Description
Antagonist activity at recombinant mouse P2X1 receptor expressed in Xenopus oocytes assessed as inhibition of ATP-induced ion current preincubated fo...
Eur J Med Chem 70: 811-30 (2013)
Article DOI: 10.1016/j.ejmech.2013.10.026
BindingDB Entry DOI: 10.7270/Q2M61MQH
P2X purinoceptor 3
(Homo sapiens (Human))
BDBM50444418
(CHEMBL3091606)
Show SMILES Cc1nc(\C=C\c2ccccc2)c(C(O)=O)c(C(O)=O)c1O
Show InChI InChI=1S/C16H13NO5/c1-9-14(18)13(16(21)22)12(15(19)20)11(17-9)8-7-10-5-3-2-4-6-10/h2-8,18H,1H3,(H,19,20)(H,21,22)/b8-7+
n/an/a 920n/an/an/an/an/an/a
Gwangju Institute of Science and Technology (GIST)
Curated by ChEMBL
Assay Description
Antagonist activity at recombinant human P2X3 receptor expressed in Xenopus oocytes assessed as inhibition of ATP-induced ion current preincubated fo...
Eur J Med Chem 70: 811-30 (2013)
Article DOI: 10.1016/j.ejmech.2013.10.026
BindingDB Entry DOI: 10.7270/Q2M61MQH