BDBM50444582 CHEMBL3099715
SMILES: OCCNc1cc(nc(n1)-c1n[nH]c2cnccc12)C(F)(F)F
InChI Key: InChIKey=BQTPIWGTMSPSKT-UHFFFAOYSA-N
Data: 1 IC50  1 Kd
Activity Spreadsheet -- Enzyme Inhibition Constant Data from BindingDB
Found 2 hits for monomerid = 50444582
Trg + Lig
Ki
nM
ΔG°
kcal/mole
IC50
nM
Kd
nM
EC50/IC50
nM
koff
s-1
kon
M-1s-1
pHTemp
°C
DNA ligase
(Staphylococcus aureus)
BDBM50444582
(CHEMBL3099715)
Show SMILES OCCNc1cc(nc(n1)-c1n[nH]c2cnccc12)C(F)(F)F
Show InChI InChI=1S/C13H11F3N6O/c14-13(15,16)9-5-10(18-3-4-23)20-12(19-9)11-7-1-2-17-6-8(7)21-22-11/h1-2,5-6,23H,3-4H2,(H,21,22)(H,18,19,20)
n/an/a 15n/an/an/an/an/an/a
Astex Pharmaceuticals Inc.
Curated by ChEMBL
Assay Description
Inhibition of C-terminal 6xHis-tagged full length recombinant Staphylococcus aureus DNA ligase (1 to 312) expressed in Escherichia coli BL21 (DE3) us...
ACS Med Chem Lett 4: 1208-12 (2013)
Article DOI: 10.1021/ml4003277
BindingDB Entry DOI: 10.7270/Q2J967V2
DNA ligase
(Staphylococcus aureus)
BDBM50444582
(CHEMBL3099715)
Show SMILES OCCNc1cc(nc(n1)-c1n[nH]c2cnccc12)C(F)(F)F
Show InChI InChI=1S/C13H11F3N6O/c14-13(15,16)9-5-10(18-3-4-23)20-12(19-9)11-7-1-2-17-6-8(7)21-22-11/h1-2,5-6,23H,3-4H2,(H,21,22)(H,18,19,20)
n/an/an/a 25n/an/an/an/an/a
Astex Pharmaceuticals Inc.
Curated by ChEMBL
Assay Description
Binding affinity to C-terminal 6xHis-tagged Staphylococcus aureus DNA ligase (1 to 312) expressed in Escherichia coli BL21 (DE3) by ITC assay
ACS Med Chem Lett 4: 1208-12 (2013)
Article DOI: 10.1021/ml4003277
BindingDB Entry DOI: 10.7270/Q2J967V2