BDBM50444926 CHEMBL3099745
SMILES: COC(=O)[C@H](Cc1cccc(O)c1)NC(=O)c1cc(C(O)=O)c2cc(ccc2n1)-c1cccc(c1)C(F)(F)F
InChI Key: InChIKey=XGGSNKUHNSVXHM-DEOSSOPVSA-N
Data: 1 KI  1 IC50  1 Kd
Activity Spreadsheet -- Enzyme Inhibition Constant Data from BindingDB
Found 3 hits for monomerid = 50444926
Trg + Lig
Ki
nM
ΔG°
kcal/mole
IC50
nM
Kd
nM
EC50/IC50
nM
koff
s-1
kon
M-1s-1
pHTemp
°C
Cyclin-dependent kinase 2
(Homo sapiens (Human))
BDBM50444926
(CHEMBL3099745)
Show SMILES COC(=O)[C@H](Cc1cccc(O)c1)NC(=O)c1cc(C(O)=O)c2cc(ccc2n1)-c1cccc(c1)C(F)(F)F |r|
Show InChI InChI=1S/C28H21F3N2O6/c1-39-27(38)24(11-15-4-2-7-19(34)10-15)33-25(35)23-14-21(26(36)37)20-13-17(8-9-22(20)32-23)16-5-3-6-18(12-16)28(29,30)31/h2-10,12-14,24,34H,11H2,1H3,(H,33,35)(H,36,37)/t24-/m0/s1
NCI pathway
Reactome pathway
>4.00E+4n/an/an/an/an/an/an/an/a
Merck Research Laboratories
Curated by ChEMBL
Assay Description
Displacement of B-Alexa-Fluor647 from CDK2 (unknown origin) by fluorescence polarization assay
Bioorg Med Chem Lett 24: 199-203 (2013)
Article DOI: 10.1016/j.bmcl.2013.11.041
BindingDB Entry DOI: 10.7270/Q2SN0BF8
Cyclin-dependent kinase 2
(Homo sapiens (Human))
BDBM50444926
(CHEMBL3099745)
Show SMILES COC(=O)[C@H](Cc1cccc(O)c1)NC(=O)c1cc(C(O)=O)c2cc(ccc2n1)-c1cccc(c1)C(F)(F)F |r|
Show InChI InChI=1S/C28H21F3N2O6/c1-39-27(38)24(11-15-4-2-7-19(34)10-15)33-25(35)23-14-21(26(36)37)20-13-17(8-9-22(20)32-23)16-5-3-6-18(12-16)28(29,30)31/h2-10,12-14,24,34H,11H2,1H3,(H,33,35)(H,36,37)/t24-/m0/s1
NCI pathway
Reactome pathway
n/an/an/a>4.00E+4n/an/an/an/an/a
Merck Research Laboratories
Curated by ChEMBL
Assay Description
Binding affinity to CDK2 (unknown origin) at 20 to 80 degC by circular dichroism analysis
Bioorg Med Chem Lett 24: 199-203 (2013)
Article DOI: 10.1016/j.bmcl.2013.11.041
BindingDB Entry DOI: 10.7270/Q2SN0BF8
Cyclin-dependent kinase 2
(Homo sapiens (Human))
BDBM50444926
(CHEMBL3099745)
Show SMILES COC(=O)[C@H](Cc1cccc(O)c1)NC(=O)c1cc(C(O)=O)c2cc(ccc2n1)-c1cccc(c1)C(F)(F)F |r|
Show InChI InChI=1S/C28H21F3N2O6/c1-39-27(38)24(11-15-4-2-7-19(34)10-15)33-25(35)23-14-21(26(36)37)20-13-17(8-9-22(20)32-23)16-5-3-6-18(12-16)28(29,30)31/h2-10,12-14,24,34H,11H2,1H3,(H,33,35)(H,36,37)/t24-/m0/s1
NCI pathway
Reactome pathway
n/an/a>1.00E+4n/an/an/an/an/a25
Merck Research Laboratories
Curated by ChEMBL
Assay Description
Inhibition of CDK2 (unknown origin)-cyclin A interaction preincubated for 30 mins at room temperature followed by incubation at 40 degC for 30 mins b...
Bioorg Med Chem Lett 24: 199-203 (2013)
Article DOI: 10.1016/j.bmcl.2013.11.041
BindingDB Entry DOI: 10.7270/Q2SN0BF8