BDBM50444939 CHEMBL3099757
SMILES: COC(=O)[C@H](Cc1ccc(O)cc1)NC(=O)c1cc(C(O)=O)c2cc(ccc2n1)-c1ccc(Cl)cc1
InChI Key: InChIKey=WARYZYXGEAOEDW-DEOSSOPVSA-N
Data: 1 KI  1 IC50  1 Kd
Activity Spreadsheet -- Enzyme Inhibition Constant Data from BindingDB
Found 3 hits for monomerid = 50444939
Trg + Lig
Ki
nM
ΔG°
kcal/mole
IC50
nM
Kd
nM
EC50/IC50
nM
koff
s-1
kon
M-1s-1
pHTemp
°C
Cyclin-dependent kinase 2
(Homo sapiens (Human))
BDBM50444939
(CHEMBL3099757)
Show SMILES COC(=O)[C@H](Cc1ccc(O)cc1)NC(=O)c1cc(C(O)=O)c2cc(ccc2n1)-c1ccc(Cl)cc1 |r|
Show InChI InChI=1S/C27H21ClN2O6/c1-36-27(35)24(12-15-2-9-19(31)10-3-15)30-25(32)23-14-21(26(33)34)20-13-17(6-11-22(20)29-23)16-4-7-18(28)8-5-16/h2-11,13-14,24,31H,12H2,1H3,(H,30,32)(H,33,34)/t24-/m0/s1
NCI pathway
Reactome pathway
900n/an/an/an/an/an/an/an/a
Merck Research Laboratories
Curated by ChEMBL
Assay Description
Displacement of B-Alexa-Fluor647 from CDK2 (unknown origin) by fluorescence polarization assay
Bioorg Med Chem Lett 24: 199-203 (2013)
Article DOI: 10.1016/j.bmcl.2013.11.041
BindingDB Entry DOI: 10.7270/Q2SN0BF8
Cyclin-dependent kinase 2
(Homo sapiens (Human))
BDBM50444939
(CHEMBL3099757)
Show SMILES COC(=O)[C@H](Cc1ccc(O)cc1)NC(=O)c1cc(C(O)=O)c2cc(ccc2n1)-c1ccc(Cl)cc1 |r|
Show InChI InChI=1S/C27H21ClN2O6/c1-36-27(35)24(12-15-2-9-19(31)10-3-15)30-25(32)23-14-21(26(33)34)20-13-17(6-11-22(20)29-23)16-4-7-18(28)8-5-16/h2-11,13-14,24,31H,12H2,1H3,(H,30,32)(H,33,34)/t24-/m0/s1
NCI pathway
Reactome pathway
n/an/an/a 900n/an/an/an/an/a
Merck Research Laboratories
Curated by ChEMBL
Assay Description
Binding affinity to CDK2 (unknown origin) at 20 to 80 degC by circular dichroism analysis
Bioorg Med Chem Lett 24: 199-203 (2013)
Article DOI: 10.1016/j.bmcl.2013.11.041
BindingDB Entry DOI: 10.7270/Q2SN0BF8
Cyclin-dependent kinase 2
(Homo sapiens (Human))
BDBM50444939
(CHEMBL3099757)
Show SMILES COC(=O)[C@H](Cc1ccc(O)cc1)NC(=O)c1cc(C(O)=O)c2cc(ccc2n1)-c1ccc(Cl)cc1 |r|
Show InChI InChI=1S/C27H21ClN2O6/c1-36-27(35)24(12-15-2-9-19(31)10-3-15)30-25(32)23-14-21(26(33)34)20-13-17(6-11-22(20)29-23)16-4-7-18(28)8-5-16/h2-11,13-14,24,31H,12H2,1H3,(H,30,32)(H,33,34)/t24-/m0/s1
NCI pathway
Reactome pathway
n/an/a>1.00E+4n/an/an/an/an/a25
Merck Research Laboratories
Curated by ChEMBL
Assay Description
Inhibition of CDK2 (unknown origin)-cyclin A interaction preincubated for 30 mins at room temperature followed by incubation at 40 degC for 30 mins b...
Bioorg Med Chem Lett 24: 199-203 (2013)
Article DOI: 10.1016/j.bmcl.2013.11.041
BindingDB Entry DOI: 10.7270/Q2SN0BF8