BDBM50445014 CHEMBL3098249
SMILES: CCCSc1nc(N[C@@H]2C[C@H]2c2ccc(F)c(F)c2)c2nnn([C@@H]3C[C@H](OCC(O)CO)[C@@H](O)[C@H]3O)c2n1
InChI Key: InChIKey=PDKXOVMOLXKMOG-HRXYOTLZSA-N
Data: 1 IC50
Activity Spreadsheet -- Enzyme Inhibition Constant Data from BindingDB
Found 1 hit for monomerid = 50445014
Trg + Lig
Ki
nM
ΔG°
kcal/mole
IC50
nM
Kd
nM
EC50/IC50
nM
koff
s-1
kon
M-1s-1
pHTemp
°C
P2Y purinoceptor 12
(Rattus norvegicus)
BDBM50445014
(CHEMBL3098249)
Show SMILES CCCSc1nc(N[C@@H]2C[C@H]2c2ccc(F)c(F)c2)c2nnn([C@@H]3C[C@H](OCC(O)CO)[C@@H](O)[C@H]3O)c2n1 |r|
Show InChI InChI=1S/C24H30F2N6O5S/c1-2-5-38-24-28-22(27-16-7-13(16)11-3-4-14(25)15(26)6-11)19-23(29-24)32(31-30-19)17-8-18(21(36)20(17)35)37-10-12(34)9-33/h3-4,6,12-13,16-18,20-21,33-36H,2,5,7-10H2,1H3,(H,27,28,29)/t12?,13-,16+,17+,18-,20-,21+/m0/s1
Reactome pathway
n/an/a 148n/an/an/an/an/an/a
Shanghai Hengrui Pharmaceutical Co. Ltd
Curated by ChEMBL
Assay Description
Antagonist activity at P2Y12 receptor in rat platelet-rich plasma assessed as inhibition of ADP-induced platelet aggregation incubated for 5 mins pri...
Bioorg Med Chem Lett 24: 141-6 (2013)
Article DOI: 10.1016/j.bmcl.2013.11.055
BindingDB Entry DOI: 10.7270/Q24T6KVN