null
SMILES: Nc1nc2nc(cnc2c(=O)[nH]1)C(=O)NCCCC(=O)Nc1ccccc1
InChI Key: InChIKey=WVLZEAVKIUEEBF-UHFFFAOYSA-N
Activity Spreadsheet -- Enzyme Inhibition Constant Data from BindingDB
Found 1 hit for monomerid = 50445074
Trg + Lig
Ki
nM
ΔG°
kcal/mole
IC50
nM
Kd
nM
EC50/IC50
nM
koff
s-1
kon
M-1s-1
pHTemp
°C
Ricin
(Ricinus communis)
BDBM50445074
(CHEMBL3098910)
Show SMILES Nc1nc2nc(cnc2c(=O)[nH]1)C(=O)NCCCC(=O)Nc1ccccc1
Show InChI InChI=1S/C17H17N7O3/c18-17-23-14-13(16(27)24-17)20-9-11(22-14)15(26)19-8-4-7-12(25)21-10-5-2-1-3-6-10/h1-3,5-6,9H,4,7-8H2,(H,19,26)(H,21,25)(H3,18,22,23,24,27)
n/an/a 7.60E+4n/an/an/an/an/an/a
TBA
Curated by ChEMBL
Assay Description
Inhibition of castor bean ricin toxin A after 90 mins by luciferase reporter gene assay
Bioorg Med Chem Lett 23: 6799-804 (2014)
BindingDB Entry DOI: 10.7270/Q2H41SW6