BDBM50445194 CHEMBL3104629
SMILES: COCCN1CCC2(CN(c3ccccc23)c2ccccc2NC(=O)Nc2ccc(OC(F)(F)F)cc2)CC1
InChI Key: InChIKey=BBVFTRZTZQZVJZ-UHFFFAOYSA-N
Data: 1 KI  1 IC50
Activity Spreadsheet -- Enzyme Inhibition Constant Data from BindingDB
Found 2 hits for monomerid = 50445194
Trg + Lig
Ki
nM
ΔG°
kcal/mole
IC50
nM
Kd
nM
EC50/IC50
nM
koff
s-1
kon
M-1s-1
pHTemp
°C
Purinergic receptor P2Y1
(Homo sapiens (Human))
BDBM50445194
(CHEMBL3104629)
Show SMILES COCCN1CCC2(CN(c3ccccc23)c2ccccc2NC(=O)Nc2ccc(OC(F)(F)F)cc2)CC1
Show InChI InChI=1S/C29H31F3N4O3/c1-38-19-18-35-16-14-28(15-17-35)20-36(25-8-4-2-6-23(25)28)26-9-5-3-7-24(26)34-27(37)33-21-10-12-22(13-11-21)39-29(30,31)32/h2-13H,14-20H2,1H3,(H2,33,34,37)
390n/an/an/an/an/an/an/an/a
Bristol-Myers Squibb Company
Curated by ChEMBL
Assay Description
Displacement of [33P]-2MeS-ADP from human P2Y1 receptor expressed in HEK293 cells after 1 hr by scintillation counting analysis
J Med Chem 56: 9275-95 (2013)
Article DOI: 10.1021/jm4013906
BindingDB Entry DOI: 10.7270/Q2KW5HHP
Purinergic receptor P2Y1
(Homo sapiens (Human))
BDBM50445194
(CHEMBL3104629)
Show SMILES COCCN1CCC2(CN(c3ccccc23)c2ccccc2NC(=O)Nc2ccc(OC(F)(F)F)cc2)CC1
Show InChI InChI=1S/C29H31F3N4O3/c1-38-19-18-35-16-14-28(15-17-35)20-36(25-8-4-2-6-23(25)28)26-9-5-3-7-24(26)34-27(37)33-21-10-12-22(13-11-21)39-29(30,31)32/h2-13H,14-20H2,1H3,(H2,33,34,37)
n/an/a 2.54E+4n/an/an/an/an/an/a
Bristol-Myers Squibb Company
Curated by ChEMBL
Assay Description
Antagonist activity at P2Y1 receptor in platelet-enriched human plasma assessed as 2.5 uM ADP-induced platelet aggregation preincubated for 1 min fol...
J Med Chem 56: 9275-95 (2013)
Article DOI: 10.1021/jm4013906
BindingDB Entry DOI: 10.7270/Q2KW5HHP